Uploaded image for project: 'WildFly'
  1. WildFly
  2. WFLY-4334

CalendarBasedTimeoutTestCase fails consistently

    XMLWordPrintable

Details

    • Bug
    • Resolution: Won't Do
    • Major
    • 9.0.0.Final
    • None
    • EJB
    • None

    Description

      Happens on branch 8.x

      Running org.jboss.as.ejb3.timer.schedule.CalendarBasedTimeoutTestCase
      Tests run: 2, Failures: 1, Errors: 0, Skipped: 0, Time elapsed: 0.352 sec <<< FAILURE! - in org.jboss.as.ejb3.timer.schedule.CalendarBasedTimeoutTestCase
      testCalendarBasedTimeout(org.jboss.as.ejb3.timer.schedule.CalendarBasedTimeoutTestCase)  Time elapsed: 0.342 sec  <<< FAILURE!
      java.lang.AssertionError: Eastern European Time
      	at org.junit.Assert.fail(Assert.java:88)
      	at org.jboss.as.ejb3.timer.schedule.CalendarBasedTimeoutTestCase.testWithStartInThePast(CalendarBasedTimeoutTestCase.java:539)
      	at org.jboss.as.ejb3.timer.schedule.CalendarBasedTimeoutTestCase.testCalendarBasedTimeout(CalendarBasedTimeoutTestCase.java:129)
      

      Attachments

        Activity

          People

            Unassigned Unassigned
            tdiesler@redhat.com Thomas Diesler
            Votes:
            1 Vote for this issue
            Watchers:
            2 Start watching this issue

            Dates

              Created:
              Updated:
              Resolved: