Uploaded image for project: 'WildFly'
  1. WildFly
  2. WFLY-15336

LayersTestCase fails complaining about some modules not provisioned

    XMLWordPrintable

Details

    Description

      LayersTestCase fails with the following error trace:

      [INFO] Running org.jboss.as.test.layers.LayersTestCase
      [ERROR] Tests run: 3, Failures: 0, Errors: 1, Skipped: 0, Time elapsed: 171.207 s <<< FAILURE! - in org.jboss.as.test.layers.LayersTestCase
      [ERROR] testServlet(org.jboss.as.test.layers.LayersTestCase)  Time elapsed: 5.622 s  <<< ERROR!
      java.lang.Exception: ERROR, some modules have not been provisioned: javax.transaction.api,
      	at org.jboss.as.test.layers.LayersTest.test(LayersTest.java:132)
      	at org.jboss.as.test.layers.LayersTestCase.testServlet(LayersTestCase.java:137)
      	at java.base/jdk.internal.reflect.NativeMethodAccessorImpl.invoke0(Native Method)
      	at java.base/jdk.internal.reflect.NativeMethodAccessorImpl.invoke(NativeMethodAccessorImpl.java:62)
      	at java.base/jdk.internal.reflect.DelegatingMethodAccessorImpl.invoke(DelegatingMethodAccessorImpl.java:43)
      	at java.base/java.lang.reflect.Method.invoke(Method.java:566)
      	at org.junit.runners.model.FrameworkMethod$1.runReflectiveCall(FrameworkMethod.java:59)
      	at org.junit.internal.runners.model.ReflectiveCallable.run(ReflectiveCallable.java:12)
      	at org.junit.runners.model.FrameworkMethod.invokeExplosively(FrameworkMethod.java:56)
      	at org.junit.internal.runners.statements.InvokeMethod.evaluate(InvokeMethod.java:17)
      	at org.junit.runners.ParentRunner$3.evaluate(ParentRunner.java:306)
      	at org.junit.runners.BlockJUnit4ClassRunner$1.evaluate(BlockJUnit4ClassRunner.java:100)
      	at org.junit.runners.ParentRunner.runLeaf(ParentRunner.java:366)
      	at org.junit.runners.BlockJUnit4ClassRunner.runChild(BlockJUnit4ClassRunner.java:103)
      	at org.junit.runners.BlockJUnit4ClassRunner.runChild(BlockJUnit4ClassRunner.java:63)
      	at org.junit.runners.ParentRunner$4.run(ParentRunner.java:331)
      	at org.junit.runners.ParentRunner$1.schedule(ParentRunner.java:79)
      	at org.junit.runners.ParentRunner.runChildren(ParentRunner.java:329)
      	at org.junit.runners.ParentRunner.access$100(ParentRunner.java:66)
      	at org.junit.runners.ParentRunner$2.evaluate(ParentRunner.java:293)
      	at org.junit.internal.runners.statements.RunBefores.evaluate(RunBefores.java:26)
      	at org.junit.internal.runners.statements.RunAfters.evaluate(RunAfters.java:27)
      	at org.junit.runners.ParentRunner$3.evaluate(ParentRunner.java:306)
      	at org.junit.runners.ParentRunner.run(ParentRunner.java:413)
      	at org.apache.maven.surefire.junit4.JUnit4Provider.execute(JUnit4Provider.java:365)
      	at org.apache.maven.surefire.junit4.JUnit4Provider.executeWithRerun(JUnit4Provider.java:273)
      	at org.apache.maven.surefire.junit4.JUnit4Provider.executeTestSet(JUnit4Provider.java:238)
      	at org.apache.maven.surefire.junit4.JUnit4Provider.invoke(JUnit4Provider.java:159)
      	at org.apache.maven.surefire.booter.ForkedBooter.invokeProviderInSameClassLoader(ForkedBooter.java:384)
      	at org.apache.maven.surefire.booter.ForkedBooter.runSuitesInProcess(ForkedBooter.java:345)
      	at org.apache.maven.surefire.booter.ForkedBooter.execute(ForkedBooter.java:126)
      	at org.apache.maven.surefire.booter.ForkedBooter.main(ForkedBooter.java:418)
      
      [INFO]
      [INFO] Results:
      [INFO]
      [ERROR] Errors:
      [ERROR]   LayersTestCase.testServlet:137 »  ERROR, some modules have not been provisione...
      [INFO]
      [ERROR] Tests run: 3, Failures: 0, Errors: 1, Skipped: 0
      
      

       

      This failure also affects to wildfly-core Galleon full integration Job.

       

      Attachments

        Activity

          People

            yborgess1@redhat.com Yeray Borges Santana
            yborgess1@redhat.com Yeray Borges Santana
            Votes:
            0 Vote for this issue
            Watchers:
            2 Start watching this issue

            Dates

              Created:
              Updated:
              Resolved: