Uploaded image for project: 'WildFly'
  1. WildFly
  2. WFLY-14450

CompositeSessionMetaDataTestCase fails intermittently

    XMLWordPrintable

    Details

      Description

      [INFO] Running org.wildfly.clustering.web.cache.session.CompositeSessionMetaDataTestCase
      [ERROR] Tests run: 8, Failures: 1, Errors: 0, Skipped: 0, Time elapsed: 0.006 s <<< FAILURE! - in org.wildfly.clustering.web.cache.session.CompositeSessionMetaDataTestCase
      [ERROR] isExpired(org.wildfly.clustering.web.cache.session.CompositeSessionMetaDataTestCase)  Time elapsed: 0.004 s  <<< FAILURE!
      java.lang.AssertionError
              at org.junit.Assert.fail(Assert.java:87)
              at org.junit.Assert.assertTrue(Assert.java:42)
              at org.junit.Assert.assertTrue(Assert.java:53)
              at org.wildfly.clustering.web.cache.session.CompositeSessionMetaDataTestCase.isExpired(CompositeSessionMetaDataTestCase.java:67)
              at sun.reflect.NativeMethodAccessorImpl.invoke0(Native Method)
              at sun.reflect.NativeMethodAccessorImpl.invoke(NativeMethodAccessorImpl.java:62)
              at sun.reflect.DelegatingMethodAccessorImpl.invoke(DelegatingMethodAccessorImpl.java:43)
              at java.lang.reflect.Method.invoke(Method.java:498)
              at org.junit.runners.model.FrameworkMethod$1.runReflectiveCall(FrameworkMethod.java:59)
              at org.junit.internal.runners.model.ReflectiveCallable.run(ReflectiveCallable.java:12)
              at org.junit.runners.model.FrameworkMethod.invokeExplosively(FrameworkMethod.java:56)
              at org.junit.internal.runners.statements.InvokeMethod.evaluate(InvokeMethod.java:17)
              at org.junit.runners.ParentRunner$3.evaluate(ParentRunner.java:306)
              at org.junit.runners.BlockJUnit4ClassRunner$1.evaluate(BlockJUnit4ClassRunner.java:100)
              at org.junit.runners.ParentRunner.runLeaf(ParentRunner.java:366)
              at org.junit.runners.BlockJUnit4ClassRunner.runChild(BlockJUnit4ClassRunner.java:103)
              at org.junit.runners.BlockJUnit4ClassRunner.runChild(BlockJUnit4ClassRunner.java:63)
              at org.junit.runners.ParentRunner$4.run(ParentRunner.java:331)
              at org.junit.runners.ParentRunner$1.schedule(ParentRunner.java:79)
              at org.junit.runners.ParentRunner.runChildren(ParentRunner.java:329)
              at org.junit.runners.ParentRunner.access$100(ParentRunner.java:66)
              at org.junit.runners.ParentRunner$2.evaluate(ParentRunner.java:293)
              at org.junit.runners.ParentRunner$3.evaluate(ParentRunner.java:306)
              at org.junit.runners.ParentRunner.run(ParentRunner.java:413)
              at org.apache.maven.surefire.junit4.JUnit4Provider.execute(JUnit4Provider.java:365)
              at org.apache.maven.surefire.junit4.JUnit4Provider.executeWithRerun(JUnit4Provider.java:273)
              at org.apache.maven.surefire.junit4.JUnit4Provider.executeTestSet(JUnit4Provider.java:238)
              at org.apache.maven.surefire.junit4.JUnit4Provider.invoke(JUnit4Provider.java:159)
              at org.apache.maven.surefire.booter.ForkedBooter.invokeProviderInSameClassLoader(ForkedBooter.java:384)
              at org.apache.maven.surefire.booter.ForkedBooter.runSuitesInProcess(ForkedBooter.java:345)
              at org.apache.maven.surefire.booter.ForkedBooter.execute(ForkedBooter.java:126)
              at org.apache.maven.surefire.booter.ForkedBooter.main(ForkedBooter.java:418)
      

        Attachments

          Activity

            People

            Assignee:
            pferraro Paul Ferraro
            Reporter:
            pferraro Paul Ferraro
            Votes:
            0 Vote for this issue
            Watchers:
            1 Start watching this issue

              Dates

              Created:
              Updated:
              Resolved: