Uploaded image for project: 'WildFly'
  1. WildFly
  2. WFLY-14079

Web Services Test Failures on openjdk version "1.8.0_272"

    XMLWordPrintable

Details

    • ---
    • ---

    Description

      [ERROR] Tests run: 1, Failures: 0, Errors: 1, Skipped: 0, Time elapsed: 0.931 s <<< FAILURE! - in org.jboss.as.test.integration.ws.wsse.trust.WSBearerElytronSecurityPropagationTestCase
      [ERROR] testBearer(org.jboss.as.test.integration.ws.wsse.trust.WSBearerElytronSecurityPropagationTestCase)  Time elapsed: 0.072 s  <<< ERROR!
      javax.xml.ws.WebServiceException: org.apache.cxf.service.factory.ServiceConstructionException: Failed to create service.
      	at org.apache.cxf.jaxws.ServiceImpl.initialize(ServiceImpl.java:162)
      	at org.apache.cxf.jaxws.ServiceImpl.<init>(ServiceImpl.java:128)
      	at org.jboss.wsf.stack.cxf.client.ProviderImpl$JBossWSServiceImpl.<init>(ProviderImpl.java:574)
      	at org.jboss.wsf.stack.cxf.client.ProviderImpl.createServiceDelegate(ProviderImpl.java:258)
      	at javax.xml.ws.Service.<init>(Service.java:77)
      	at javax.xml.ws.Service.create(Service.java:707)
      	at org.jboss.as.test.integration.ws.wsse.trust.WSBearerElytronSecurityPropagationTestCase.testBearer(WSBearerElytronSecurityPropagationTestCase.java:129)
      	at sun.reflect.NativeMethodAccessorImpl.invoke0(Native Method)
      	at sun.reflect.NativeMethodAccessorImpl.invoke(NativeMethodAccessorImpl.java:62)
      	at sun.reflect.DelegatingMethodAccessorImpl.invoke(DelegatingMethodAccessorImpl.java:43)
      	at java.lang.reflect.Method.invoke(Method.java:498)
      	at org.junit.runners.model.FrameworkMethod$1.runReflectiveCall(FrameworkMethod.java:59)
      	at org.junit.internal.runners.model.ReflectiveCallable.run(ReflectiveCallable.java:12)
      	at org.junit.runners.model.FrameworkMethod.invokeExplosively(FrameworkMethod.java:56)
      	at org.jboss.arquillian.junit.Arquillian$8$1.invokeMethod(Arquillian.java:325)
      	at org.jboss.arquillian.junit.MethodInvoker$1.invoke(MethodInvoker.java:18)
      	at org.jboss.arquillian.container.test.impl.execution.LocalTestExecuter.execute(LocalTestExecuter.java:57)
      	at sun.reflect.GeneratedMethodAccessor58.invoke(Unknown Source)
      	at sun.reflect.DelegatingMethodAccessorImpl.invoke(DelegatingMethodAccessorImpl.java:43)
      	at java.lang.reflect.Method.invoke(Method.java:498)
      	at org.jboss.arquillian.core.impl.ObserverImpl.invoke(ObserverImpl.java:86)
      	at org.jboss.arquillian.core.impl.EventContextImpl.invokeObservers(EventContextImpl.java:103)
      	at org.jboss.arquillian.core.impl.EventContextImpl.proceed(EventContextImpl.java:90)
      	at org.jboss.arquillian.core.impl.ManagerImpl.fire(ManagerImpl.java:133)
      	at org.jboss.arquillian.core.impl.ManagerImpl.fire(ManagerImpl.java:105)
      	at org.jboss.arquillian.core.impl.EventImpl.fire(EventImpl.java:62)
      	at org.jboss.arquillian.container.test.impl.execution.ClientTestExecuter.execute(ClientTestExecuter.java:50)
      	at sun.reflect.GeneratedMethodAccessor56.invoke(Unknown Source)
      	at sun.reflect.DelegatingMethodAccessorImpl.invoke(DelegatingMethodAccessorImpl.java:43)
      	at java.lang.reflect.Method.invoke(Method.java:498)
      	at org.jboss.arquillian.core.impl.ObserverImpl.invoke(ObserverImpl.java:86)
      	at org.jboss.arquillian.core.impl.EventContextImpl.invokeObservers(EventContextImpl.java:103)
      	at org.jboss.arquillian.core.impl.EventContextImpl.proceed(EventContextImpl.java:90)
      	at org.jboss.arquillian.container.test.impl.client.ContainerEventController.createContext(ContainerEventController.java:128)
      	at org.jboss.arquillian.container.test.impl.client.ContainerEventController.createTestContext(ContainerEventController.java:118)
      	at sun.reflect.GeneratedMethodAccessor55.invoke(Unknown Source)
      	at sun.reflect.DelegatingMethodAccessorImpl.invoke(DelegatingMethodAccessorImpl.java:43)
      	at java.lang.reflect.Method.invoke(Method.java:498)
      	at org.jboss.arquillian.core.impl.ObserverImpl.invoke(ObserverImpl.java:86)
      	at org.jboss.arquillian.core.impl.EventContextImpl.proceed(EventContextImpl.java:95)
      	at org.jboss.arquillian.test.impl.TestContextHandler.createTestContext(TestContextHandler.java:116)
      	at sun.reflect.GeneratedMethodAccessor21.invoke(Unknown Source)
      	at sun.reflect.DelegatingMethodAccessorImpl.invoke(DelegatingMethodAccessorImpl.java:43)
      	at java.lang.reflect.Method.invoke(Method.java:498)
      	at org.jboss.arquillian.core.impl.ObserverImpl.invoke(ObserverImpl.java:86)
      	at org.jboss.arquillian.core.impl.EventContextImpl.proceed(EventContextImpl.java:95)
      	at org.jboss.arquillian.test.impl.TestContextHandler.createClassContext(TestContextHandler.java:83)
      	at sun.reflect.GeneratedMethodAccessor20.invoke(Unknown Source)
      	at sun.reflect.DelegatingMethodAccessorImpl.invoke(DelegatingMethodAccessorImpl.java:43)
      	at java.lang.reflect.Method.invoke(Method.java:498)
      	at org.jboss.arquillian.core.impl.ObserverImpl.invoke(ObserverImpl.java:86)
      	at org.jboss.arquillian.core.impl.EventContextImpl.proceed(EventContextImpl.java:95)
      	at org.jboss.arquillian.test.impl.TestContextHandler.createSuiteContext(TestContextHandler.java:69)
      	at sun.reflect.GeneratedMethodAccessor19.invoke(Unknown Source)
      	at sun.reflect.DelegatingMethodAccessorImpl.invoke(DelegatingMethodAccessorImpl.java:43)
      	at java.lang.reflect.Method.invoke(Method.java:498)
      	at org.jboss.arquillian.core.impl.ObserverImpl.invoke(ObserverImpl.java:86)
      	at org.jboss.arquillian.core.impl.EventContextImpl.proceed(EventContextImpl.java:95)
      	at org.jboss.arquillian.core.impl.ManagerImpl.fire(ManagerImpl.java:133)
      	at org.jboss.arquillian.test.impl.EventTestRunnerAdaptor.test(EventTestRunnerAdaptor.java:139)
      	at org.jboss.arquillian.junit.MethodInvoker.invoke(MethodInvoker.java:15)
      	at org.jboss.arquillian.junit.Arquillian$8.evaluate(Arquillian.java:332)
      	at org.jboss.arquillian.junit.Arquillian$4.evaluate(Arquillian.java:204)
      	at org.jboss.arquillian.junit.Arquillian.multiExecute(Arquillian.java:350)
      	at org.jboss.arquillian.junit.Arquillian.access$200(Arquillian.java:54)
      	at org.jboss.arquillian.junit.Arquillian$5.evaluate(Arquillian.java:215)
      	at org.junit.rules.TestWatcher$1.evaluate(TestWatcher.java:61)
      	at org.jboss.arquillian.junit.Arquillian$7$1.invoke(Arquillian.java:279)
      	at org.jboss.arquillian.container.test.impl.execution.ClientBeforeAfterLifecycleEventExecuter.execute(ClientBeforeAfterLifecycleEventExecuter.java:88)
      	at org.jboss.arquillian.container.test.impl.execution.ClientBeforeAfterLifecycleEventExecuter.on(ClientBeforeAfterLifecycleEventExecuter.java:66)
      	at sun.reflect.GeneratedMethodAccessor33.invoke(Unknown Source)
      	at sun.reflect.DelegatingMethodAccessorImpl.invoke(DelegatingMethodAccessorImpl.java:43)
      	at java.lang.reflect.Method.invoke(Method.java:498)
      	at org.jboss.arquillian.core.impl.ObserverImpl.invoke(ObserverImpl.java:86)
      	at org.jboss.arquillian.core.impl.EventContextImpl.invokeObservers(EventContextImpl.java:103)
      	at org.jboss.arquillian.core.impl.EventContextImpl.proceed(EventContextImpl.java:90)
      	at org.jboss.arquillian.container.test.impl.client.ContainerEventController.createContext(ContainerEventController.java:128)
      	at org.jboss.arquillian.container.test.impl.client.ContainerEventController.createBeforeContext(ContainerEventController.java:114)
      	at sun.reflect.GeneratedMethodAccessor32.invoke(Unknown Source)
      	at sun.reflect.DelegatingMethodAccessorImpl.invoke(DelegatingMethodAccessorImpl.java:43)
      	at java.lang.reflect.Method.invoke(Method.java:498)
      	at org.jboss.arquillian.core.impl.ObserverImpl.invoke(ObserverImpl.java:86)
      	at org.jboss.arquillian.core.impl.EventContextImpl.proceed(EventContextImpl.java:95)
      	at org.jboss.arquillian.test.impl.TestContextHandler.createTestContext(TestContextHandler.java:116)
      	at sun.reflect.GeneratedMethodAccessor21.invoke(Unknown Source)
      	at sun.reflect.DelegatingMethodAccessorImpl.invoke(DelegatingMethodAccessorImpl.java:43)
      	at java.lang.reflect.Method.invoke(Method.java:498)
      	at org.jboss.arquillian.core.impl.ObserverImpl.invoke(ObserverImpl.java:86)
      	at org.jboss.arquillian.core.impl.EventContextImpl.proceed(EventContextImpl.java:95)
      	at org.jboss.arquillian.test.impl.TestContextHandler.createClassContext(TestContextHandler.java:83)
      	at sun.reflect.GeneratedMethodAccessor20.invoke(Unknown Source)
      	at sun.reflect.DelegatingMethodAccessorImpl.invoke(DelegatingMethodAccessorImpl.java:43)
      	at java.lang.reflect.Method.invoke(Method.java:498)
      	at org.jboss.arquillian.core.impl.ObserverImpl.invoke(ObserverImpl.java:86)
      	at org.jboss.arquillian.core.impl.EventContextImpl.proceed(EventContextImpl.java:95)
      	at org.jboss.arquillian.test.impl.TestContextHandler.createSuiteContext(TestContextHandler.java:69)
      	at sun.reflect.GeneratedMethodAccessor19.invoke(Unknown Source)
      	at sun.reflect.DelegatingMethodAccessorImpl.invoke(DelegatingMethodAccessorImpl.java:43)
      	at java.lang.reflect.Method.invoke(Method.java:498)
      	at org.jboss.arquillian.core.impl.ObserverImpl.invoke(ObserverImpl.java:86)
      	at org.jboss.arquillian.core.impl.EventContextImpl.proceed(EventContextImpl.java:95)
      	at org.jboss.arquillian.core.impl.ManagerImpl.fire(ManagerImpl.java:133)
      	at org.jboss.arquillian.core.impl.ManagerImpl.fire(ManagerImpl.java:105)
      	at org.jboss.arquillian.test.impl.EventTestRunnerAdaptor.fireCustomLifecycle(EventTestRunnerAdaptor.java:159)
      	at org.jboss.arquillian.junit.Arquillian$7.evaluate(Arquillian.java:273)
      	at org.junit.runners.BlockJUnit4ClassRunner$1.evaluate(BlockJUnit4ClassRunner.java:100)
      	at org.junit.runners.ParentRunner.runLeaf(ParentRunner.java:366)
      	at org.junit.runners.BlockJUnit4ClassRunner.runChild(BlockJUnit4ClassRunner.java:103)
      	at org.junit.runners.BlockJUnit4ClassRunner.runChild(BlockJUnit4ClassRunner.java:63)
      	at org.junit.runners.ParentRunner$4.run(ParentRunner.java:331)
      	at org.junit.runners.ParentRunner$1.schedule(ParentRunner.java:79)
      	at org.junit.runners.ParentRunner.runChildren(ParentRunner.java:329)
      	at org.junit.runners.ParentRunner.access$100(ParentRunner.java:66)
      	at org.junit.runners.ParentRunner$2.evaluate(ParentRunner.java:293)
      	at org.jboss.arquillian.junit.Arquillian$2.evaluate(Arquillian.java:166)
      	at org.jboss.arquillian.junit.Arquillian.multiExecute(Arquillian.java:350)
      	at org.jboss.arquillian.junit.Arquillian.access$200(Arquillian.java:54)
      	at org.jboss.arquillian.junit.Arquillian$3.evaluate(Arquillian.java:177)
      	at org.junit.runners.ParentRunner$3.evaluate(ParentRunner.java:306)
      	at org.junit.runners.ParentRunner.run(ParentRunner.java:413)
      	at org.jboss.arquillian.junit.Arquillian.run(Arquillian.java:115)
      	at org.apache.maven.surefire.junit4.JUnit4Provider.execute(JUnit4Provider.java:365)
      	at org.apache.maven.surefire.junit4.JUnit4Provider.executeWithRerun(JUnit4Provider.java:273)
      	at org.apache.maven.surefire.junit4.JUnit4Provider.executeTestSet(JUnit4Provider.java:238)
      	at org.apache.maven.surefire.junit4.JUnit4Provider.invoke(JUnit4Provider.java:159)
      	at org.apache.maven.surefire.booter.ForkedBooter.invokeProviderInSameClassLoader(ForkedBooter.java:384)
      	at org.apache.maven.surefire.booter.ForkedBooter.runSuitesInProcess(ForkedBooter.java:345)
      	at org.apache.maven.surefire.booter.ForkedBooter.execute(ForkedBooter.java:126)
      	at org.apache.maven.surefire.booter.ForkedBooter.main(ForkedBooter.java:418)
      Caused by: org.apache.cxf.service.factory.ServiceConstructionException: Failed to create service.
      	at org.apache.cxf.wsdl11.WSDLServiceFactory.<init>(WSDLServiceFactory.java:87)
      	at org.apache.cxf.jaxws.ServiceImpl.initializePorts(ServiceImpl.java:217)
      	at org.apache.cxf.jaxws.ServiceImpl.initialize(ServiceImpl.java:160)
      	... 128 more
      Caused by: javax.wsdl.WSDLException: WSDLException (at /definitions/types/xsd:schema): faultCode=PARSER_ERROR: Problem parsing 'https://localhost:8444/jaxws-samples-wsse-policy-trust-bearer/BearerService?xsd=BearerService_schema1.xsd'.: javax.net.ssl.SSLHandshakeException: No appropriate protocol (protocol is disabled or cipher suites are inappropriate)
      	at com.ibm.wsdl.xml.WSDLReaderImpl.getDocument(WSDLReaderImpl.java:2198)
      	at com.ibm.wsdl.xml.WSDLReaderImpl.parseSchema(WSDLReaderImpl.java:830)
      	at com.ibm.wsdl.xml.WSDLReaderImpl.parseSchema(WSDLReaderImpl.java:654)
      	at com.ibm.wsdl.xml.WSDLReaderImpl.parseTypes(WSDLReaderImpl.java:610)
      	at com.ibm.wsdl.xml.WSDLReaderImpl.parseDefinitions(WSDLReaderImpl.java:320)
      	at com.ibm.wsdl.xml.WSDLReaderImpl.readWSDL(WSDLReaderImpl.java:2352)
      	at com.ibm.wsdl.xml.WSDLReaderImpl.readWSDL(WSDLReaderImpl.java:2338)
      	at org.apache.cxf.wsdl11.WSDLManagerImpl.loadDefinition(WSDLManagerImpl.java:255)
      	at org.apache.cxf.wsdl11.WSDLManagerImpl.getDefinition(WSDLManagerImpl.java:165)
      	at org.apache.cxf.wsdl11.WSDLServiceFactory.<init>(WSDLServiceFactory.java:85)
      	... 130 more
      Caused by: javax.net.ssl.SSLHandshakeException: No appropriate protocol (protocol is disabled or cipher suites are inappropriate)
      	at sun.security.ssl.HandshakeContext.<init>(HandshakeContext.java:171)
      	at sun.security.ssl.ClientHandshakeContext.<init>(ClientHandshakeContext.java:98)
      	at sun.security.ssl.TransportContext.kickstart(TransportContext.java:220)
      	at sun.security.ssl.SSLSocketImpl.startHandshake(SSLSocketImpl.java:387)
      	at sun.net.www.protocol.https.HttpsClient.afterConnect(HttpsClient.java:559)
      	at sun.net.www.protocol.https.AbstractDelegateHttpsURLConnection.connect(AbstractDelegateHttpsURLConnection.java:185)
      	at sun.net.www.protocol.http.HttpURLConnection.getInputStream0(HttpURLConnection.java:1570)
      	at sun.net.www.protocol.http.HttpURLConnection.getInputStream(HttpURLConnection.java:1498)
      	at sun.net.www.protocol.https.HttpsURLConnectionImpl.getInputStream(HttpsURLConnectionImpl.java:268)
      	at org.apache.xerces.impl.XMLEntityManager.setupCurrentEntity(XMLEntityManager.java:1033)
      	at org.apache.xerces.impl.XMLVersionDetector.determineDocVersion(XMLVersionDetector.java:144)
      	at org.apache.xerces.parsers.XML11Configuration.parse(XML11Configuration.java:832)
      	at org.apache.xerces.parsers.XML11Configuration.parse(XML11Configuration.java:798)
      	at org.apache.xerces.parsers.XMLParser.parse(XMLParser.java:108)
      	at org.apache.xerces.parsers.DOMParser.parse(DOMParser.java:230)
      	at org.apache.xerces.jaxp.DocumentBuilderImpl.parse(DocumentBuilderImpl.java:298)
      	at com.ibm.wsdl.xml.WSDLReaderImpl.getDocument(WSDLReaderImpl.java:2188)
      	... 139 more
      
      

      Attachments

        Issue Links

          Activity

            People

              darran.lofthouse@redhat.com Darran Lofthouse
              darran.lofthouse@redhat.com Darran Lofthouse
              Votes:
              0 Vote for this issue
              Watchers:
              1 Start watching this issue

              Dates

                Created:
                Updated:
                Resolved: