Uploaded image for project: 'WildFly Core'
  1. WildFly Core
  2. WFCORE-5694

RealmsTestCase fails on Mac

    XMLWordPrintable

Details

    Description

      [*INFO*] Running org.wildfly.extension.elytron.RealmsTestCase

      [*ERROR*] Tests run: 9, Failures: 1, Errors: 0, Skipped: 1, Time elapsed: 3.979 s <<< FAILURE! - in org.wildfly.extension.elytron.RealmsTestCase

      [*ERROR*] testPropertyRealm(org.wildfly.extension.elytron.RealmsTestCase)  Time elapsed: 0.111 s  <<< FAILURE!

      java.lang.AssertionError: Identity user999 is not detected after external modification

      at org.wildfly.extension.elytron.RealmsTestCase.testExternalModificationPropertyRealm(RealmsTestCase.java:167)

      at org.wildfly.extension.elytron.RealmsTestCase.testPropertyRealm(RealmsTestCase.java:88)

       

      Attachments

        Activity

          People

            rhn-support-rmartinc Ricardo Martin Camarero
            kkhan1@redhat.com Kabir Khan
            Votes:
            0 Vote for this issue
            Watchers:
            2 Start watching this issue

            Dates

              Created:
              Updated:
              Resolved: