Uploaded image for project: 'WildFly Core'
  1. WildFly Core
  2. WFCORE-4102

ModelPersistenceTestCase fails when running after ReadConfigAsFeaturesStandaloneTestCase

    Details

    • Steps to Reproduce:
      Hide
      cd testsuite/standalone
      mvn test -Dtest=org.wildfly.core.test.standalone.mgmt.api.core.ReadConfigAsFeaturesStandaloneTestCase,org.wildfly.core.test.standalone.mgmt.api.ModelPersistenceTestCase -Dsurefire.runOrder=reversealphabetical
      
      Show
      cd testsuite/standalone mvn test -Dtest=org.wildfly.core.test.standalone.mgmt.api.core.ReadConfigAsFeaturesStandaloneTestCase,org.wildfly.core.test.standalone.mgmt.api.ModelPersistenceTestCase -Dsurefire.runOrder=reversealphabetical

      Description

      ModelPersistenceTestCase fails when ReadConfigAsFeaturesStandaloneTestCase runs in order before it.

      Not depending on JDK version - affects JDK 8,9,11.

      [INFO] Running org.wildfly.core.test.standalone.mgmt.api.core.ReadConfigAsFeaturesStandaloneTestCase
      [INFO] Tests run: 10, Failures: 0, Errors: 0, Skipped: 0, Time elapsed: 4.29 s - in org.wildfly.core.test.standalone.mgmt.api.core.ReadConfigAsFeaturesStandaloneTestCase
      [INFO] Running org.wildfly.core.test.standalone.mgmt.api.ModelPersistenceTestCase
      [ERROR] Tests run: 5, Failures: 0, Errors: 2, Skipped: 0, Time elapsed: 0.088 s <<< FAILURE! - in org.wildfly.core.test.standalone.mgmt.api.ModelPersistenceTestCase
      [ERROR] testTakeAndDeleteSnapshot(org.wildfly.core.test.standalone.mgmt.api.ModelPersistenceTestCase)  Time elapsed: 0.017 s  <<< ERROR!
      java.io.FileNotFoundException: /home/jkalina/work/wildfly-core/testsuite/standalone/target/wildfly-core/standalone/configuration/standalone_xml_history/20180910-161302223standalone.last.xml (No such file or directory)
      	at java.io.FileInputStream.open0(Native Method)
      	at java.io.FileInputStream.open(FileInputStream.java:195)
      	at java.io.FileInputStream.<init>(FileInputStream.java:138)
      	at org.apache.commons.io.FileUtils.checksum(FileUtils.java:2873)
      	at org.apache.commons.io.FileUtils.checksumCRC32(FileUtils.java:2846)
      	at org.wildfly.core.test.standalone.mgmt.api.ModelPersistenceTestCase.testTakeAndDeleteSnapshot(ModelPersistenceTestCase.java:207)
      	at sun.reflect.NativeMethodAccessorImpl.invoke0(Native Method)
      	at sun.reflect.NativeMethodAccessorImpl.invoke(NativeMethodAccessorImpl.java:62)
      	at sun.reflect.DelegatingMethodAccessorImpl.invoke(DelegatingMethodAccessorImpl.java:43)
      	at java.lang.reflect.Method.invoke(Method.java:498)
      	at org.junit.runners.model.FrameworkMethod$1.runReflectiveCall(FrameworkMethod.java:50)
      	at org.junit.internal.runners.model.ReflectiveCallable.run(ReflectiveCallable.java:12)
      	at org.junit.runners.model.FrameworkMethod.invokeExplosively(FrameworkMethod.java:47)
      	at org.junit.internal.runners.statements.InvokeMethod.evaluate(InvokeMethod.java:17)
      	at org.junit.internal.runners.statements.RunBefores.evaluate(RunBefores.java:26)
      	at org.junit.runners.ParentRunner.runLeaf(ParentRunner.java:325)
      	at org.junit.runners.BlockJUnit4ClassRunner.runChild(BlockJUnit4ClassRunner.java:78)
      	at org.junit.runners.BlockJUnit4ClassRunner.runChild(BlockJUnit4ClassRunner.java:57)
      	at org.junit.runners.ParentRunner$3.run(ParentRunner.java:290)
      	at org.junit.runners.ParentRunner$1.schedule(ParentRunner.java:71)
      	at org.junit.runners.ParentRunner.runChildren(ParentRunner.java:288)
      	at org.junit.runners.ParentRunner.access$000(ParentRunner.java:58)
      	at org.junit.runners.ParentRunner$2.evaluate(ParentRunner.java:268)
      	at org.junit.runners.ParentRunner.run(ParentRunner.java:363)
      	at org.wildfly.core.testrunner.WildflyTestRunner.run(WildflyTestRunner.java:109)
      	at org.junit.runners.Suite.runChild(Suite.java:128)
      	at org.junit.runners.Suite.runChild(Suite.java:27)
      	at org.junit.runners.ParentRunner$3.run(ParentRunner.java:290)
      	at org.junit.runners.ParentRunner$1.schedule(ParentRunner.java:71)
      	at org.junit.runners.ParentRunner.runChildren(ParentRunner.java:288)
      	at org.junit.runners.ParentRunner.access$000(ParentRunner.java:58)
      	at org.junit.runners.ParentRunner$2.evaluate(ParentRunner.java:268)
      	at org.junit.runners.ParentRunner.run(ParentRunner.java:363)
      	at org.apache.maven.surefire.junitcore.JUnitCore.run(JUnitCore.java:55)
      	at org.apache.maven.surefire.junitcore.JUnitCoreWrapper.createRequestAndRun(JUnitCoreWrapper.java:137)
      	at org.apache.maven.surefire.junitcore.JUnitCoreWrapper.executeEager(JUnitCoreWrapper.java:107)
      	at org.apache.maven.surefire.junitcore.JUnitCoreWrapper.execute(JUnitCoreWrapper.java:83)
      	at org.apache.maven.surefire.junitcore.JUnitCoreWrapper.execute(JUnitCoreWrapper.java:75)
      	at org.apache.maven.surefire.junitcore.JUnitCoreProvider.invoke(JUnitCoreProvider.java:158)
      	at org.apache.maven.surefire.booter.ForkedBooter.invokeProviderInSameClassLoader(ForkedBooter.java:383)
      	at org.apache.maven.surefire.booter.ForkedBooter.runSuitesInProcess(ForkedBooter.java:344)
      	at org.apache.maven.surefire.booter.ForkedBooter.execute(ForkedBooter.java:125)
      	at org.apache.maven.surefire.booter.ForkedBooter.main(ForkedBooter.java:417)
      

        Gliffy Diagrams

          Attachments

            Activity

              People

              • Assignee:
                rjanik Richard Janik
                Reporter:
                honza889 Jan Kalina
              • Votes:
                0 Vote for this issue
                Watchers:
                3 Start watching this issue

                Dates

                • Created:
                  Updated:
                  Resolved: