Details

    • Type: Bug
    • Status: Resolved (View Workflow)
    • Priority: Major
    • Resolution: Done
    • Affects Version/s: None
    • Fix Version/s: 3.0.0.Beta8
    • Component/s: Security
    • Labels:
      None

      Description

      There is a regression introduced by recent PicketBox upgrade (part of [1]). With PicketBox 4.9.7[2] it is possible to run performSimpleLogin() and cleanUp() methods of JBossSecurityClient class with security manager enabled. However; running these methods with PicketBox 5.0.0.Alpha3[3] causes AccessControlException.

      PicketBox 4.9.7 is in EAP 7.1.0.DR3, PicketBox 5.0.0.Alpha3 in EAP 7.1.0.DR4 and DR5 => regression against 7.1.0.DR3.

      This issue was noticed in consequence of an investigation of failed tests in AS TS run with security manager.

      Tests that fail on performSimpleLogin() method:

      • org.jboss.as.test.integration.ee.concurrent.DefaultContextServiceTestCase#testTaskSubmit
      • org.jboss.as.test.integration.ee.concurrent.DefaultManagedExecutorServiceTestCase#testTaskSubmit
      • org.jboss.as.test.integration.ee.concurrent.DefaultManagedScheduledExecutorServiceTestCase#testTaskSubmit
      • org.jboss.as.test.integration.ee.concurrent.DefaultManagedThreadFactoryTestCase#testTaskSubmit
      • org.jboss.as.test.integration.ejb.security.RunAsPrincipalTestCase#testAnonymous
      • org.jboss.as.test.integration.ejb.security.RunAsPrincipalTestCase#testJackInABox
      • org.jboss.as.test.integration.ejb.security.RunAsPrincipalTestCase#testSingletonPostconstructSecurity
      • org.jboss.as.test.integration.ejb.security.RunAsPrincipalTestCase#testSingletonPostconstructSecurityNotPropagating
      • org.jboss.as.test.integration.ejb.security.callerprincipal.GetCallerPrincipalTestCase#testMDBLifecycle
      • org.jboss.as.test.integration.ejb.security.singleton.SingletonSecurityTestCase#testInvocationOnSecuredMethodWithCorrectRole
      • org.jboss.as.test.integration.ejb.security.singleton.SingletonSecurityTestCase#testInvocationOnSecuredMethodWithInCorrectRole

      ./integration-tests.sh -DtestLogToFile=false -Dts.noSmoke -Dts.basic -Dtest=DefaultContextServiceTestCase -Dsecurity.manager

      SEVERE [org.jboss.arquillian.protocol.jmx.JMXTestRunner] (pool-3-thread-1) Failed: org.jboss.as.test.integration.ee.concurrent.DefaultContextServiceTestCase.testTaskSubmit: java.security.AccessControlException: WFSM000001: Permission check failed (permission "("java.lang.RuntimePermission" "org.jboss.security.getSecurityContext")" in code source "(vfs:/content/DefaultContextServiceTestCase.war/WEB-INF/classes <no signer certificates>)" of "ModuleClassLoader for Module "deployment.DefaultContextServiceTestCase.war:main" from Service Module Loader")
      	at org.wildfly.security.manager.WildFlySecurityManager.checkPermission(WildFlySecurityManager.java:278)
      	at org.wildfly.security.manager.WildFlySecurityManager.checkPermission(WildFlySecurityManager.java:175)
      	at org.jboss.security.SecurityContextAssociation.getSecurityContext(SecurityContextAssociation.java:145)
      	at org.jboss.security.client.JBossSecurityClient.performSimpleLogin(JBossSecurityClient.java:77)
      	at org.jboss.security.client.SecurityClient.login(SecurityClient.java:74)
      	at org.jboss.as.test.integration.ee.concurrent.DefaultContextServiceTestCase.testTaskSubmit(DefaultContextServiceTestCase.java:55)
      	at sun.reflect.NativeMethodAccessorImpl.invoke0(Native Method)
      	at sun.reflect.NativeMethodAccessorImpl.invoke(NativeMethodAccessorImpl.java:62)
      	at sun.reflect.DelegatingMethodAccessorImpl.invoke(DelegatingMethodAccessorImpl.java:43)
      	at java.lang.reflect.Method.invoke(Method.java:498)
      	at org.junit.runners.model.FrameworkMethod$1.runReflectiveCall(FrameworkMethod.java:50)
      	at org.junit.internal.runners.model.ReflectiveCallable.run(ReflectiveCallable.java:12)
      	at org.junit.runners.model.FrameworkMethod.invokeExplosively(FrameworkMethod.java:47)
      	at org.jboss.arquillian.junit.Arquillian$8$1.invoke(Arquillian.java:370)
      	at org.jboss.arquillian.container.test.impl.execution.LocalTestExecuter.execute(LocalTestExecuter.java:60)
      	at sun.reflect.NativeMethodAccessorImpl.invoke0(Native Method)
      	at sun.reflect.NativeMethodAccessorImpl.invoke(NativeMethodAccessorImpl.java:62)
      	at sun.reflect.DelegatingMethodAccessorImpl.invoke(DelegatingMethodAccessorImpl.java:43)
      	at java.lang.reflect.Method.invoke(Method.java:498)
      	at org.jboss.arquillian.core.impl.ObserverImpl.invoke(ObserverImpl.java:94)
      	at org.jboss.arquillian.core.impl.EventContextImpl.invokeObservers(EventContextImpl.java:99)
      	at org.jboss.arquillian.core.impl.EventContextImpl.proceed(EventContextImpl.java:81)
      	at org.jboss.arquillian.core.impl.ManagerImpl.fire(ManagerImpl.java:145)
      	at org.jboss.arquillian.core.impl.ManagerImpl.fire(ManagerImpl.java:116)
      	at org.jboss.arquillian.core.impl.EventImpl.fire(EventImpl.java:67)
      	at org.jboss.arquillian.container.test.impl.execution.ContainerTestExecuter.execute(ContainerTestExecuter.java:38)
      	at sun.reflect.NativeMethodAccessorImpl.invoke0(Native Method)
      	at sun.reflect.NativeMethodAccessorImpl.invoke(NativeMethodAccessorImpl.java:62)
      	at sun.reflect.DelegatingMethodAccessorImpl.invoke(DelegatingMethodAccessorImpl.java:43)
      	at java.lang.reflect.Method.invoke(Method.java:498)
      	at org.jboss.arquillian.core.impl.ObserverImpl.invoke(ObserverImpl.java:94)
      	at org.jboss.arquillian.core.impl.EventContextImpl.invokeObservers(EventContextImpl.java:99)
      	at org.jboss.arquillian.core.impl.EventContextImpl.proceed(EventContextImpl.java:81)
      	at org.jboss.arquillian.test.impl.TestContextHandler.createTestContext(TestContextHandler.java:130)
      	at sun.reflect.NativeMethodAccessorImpl.invoke0(Native Method)
      	at sun.reflect.NativeMethodAccessorImpl.invoke(NativeMethodAccessorImpl.java:62)
      	at sun.reflect.DelegatingMethodAccessorImpl.invoke(DelegatingMethodAccessorImpl.java:43)
      	at java.lang.reflect.Method.invoke(Method.java:498)
      	at org.jboss.arquillian.core.impl.ObserverImpl.invoke(ObserverImpl.java:94)
      	at org.jboss.arquillian.core.impl.EventContextImpl.proceed(EventContextImpl.java:88)
      	at org.jboss.arquillian.test.impl.TestContextHandler.createClassContext(TestContextHandler.java:92)
      	at sun.reflect.NativeMethodAccessorImpl.invoke0(Native Method)
      	at sun.reflect.NativeMethodAccessorImpl.invoke(NativeMethodAccessorImpl.java:62)
      	at sun.reflect.DelegatingMethodAccessorImpl.invoke(DelegatingMethodAccessorImpl.java:43)
      	at java.lang.reflect.Method.invoke(Method.java:498)
      	at org.jboss.arquillian.core.impl.ObserverImpl.invoke(ObserverImpl.java:94)
      	at org.jboss.arquillian.core.impl.EventContextImpl.proceed(EventContextImpl.java:88)
      	at org.jboss.arquillian.test.impl.TestContextHandler.createSuiteContext(TestContextHandler.java:73)
      	at sun.reflect.NativeMethodAccessorImpl.invoke0(Native Method)
      	at sun.reflect.NativeMethodAccessorImpl.invoke(NativeMethodAccessorImpl.java:62)
      	at sun.reflect.DelegatingMethodAccessorImpl.invoke(DelegatingMethodAccessorImpl.java:43)
      	at java.lang.reflect.Method.invoke(Method.java:498)
      	at org.jboss.arquillian.core.impl.ObserverImpl.invoke(ObserverImpl.java:94)
      	at org.jboss.arquillian.core.impl.EventContextImpl.proceed(EventContextImpl.java:88)
      	at org.jboss.arquillian.core.impl.ManagerImpl.fire(ManagerImpl.java:145)
      	at org.jboss.arquillian.test.impl.EventTestRunnerAdaptor.test(EventTestRunnerAdaptor.java:136)
      	at org.jboss.arquillian.junit.Arquillian$8.evaluate(Arquillian.java:363)
      	at org.jboss.arquillian.junit.Arquillian$4.evaluate(Arquillian.java:245)
      	at org.jboss.arquillian.junit.Arquillian.multiExecute(Arquillian.java:422)
      	at org.jboss.arquillian.junit.Arquillian.access$200(Arquillian.java:54)
      	at org.jboss.arquillian.junit.Arquillian$5.evaluate(Arquillian.java:259)
      	at org.jboss.arquillian.junit.Arquillian$7$1.invoke(Arquillian.java:315)
      	at org.jboss.arquillian.container.test.impl.execution.BeforeLifecycleEventExecuter.on(BeforeLifecycleEventExecuter.java:35)
      	at sun.reflect.NativeMethodAccessorImpl.invoke0(Native Method)
      	at sun.reflect.NativeMethodAccessorImpl.invoke(NativeMethodAccessorImpl.java:62)
      	at sun.reflect.DelegatingMethodAccessorImpl.invoke(DelegatingMethodAccessorImpl.java:43)
      	at java.lang.reflect.Method.invoke(Method.java:498)
      	at org.jboss.arquillian.core.impl.ObserverImpl.invoke(ObserverImpl.java:94)
      	at org.jboss.arquillian.core.impl.EventContextImpl.invokeObservers(EventContextImpl.java:99)
      	at org.jboss.arquillian.core.impl.EventContextImpl.proceed(EventContextImpl.java:81)
      	at org.jboss.arquillian.test.impl.TestContextHandler.createTestContext(TestContextHandler.java:130)
      	at sun.reflect.NativeMethodAccessorImpl.invoke0(Native Method)
      	at sun.reflect.NativeMethodAccessorImpl.invoke(NativeMethodAccessorImpl.java:62)
      	at sun.reflect.DelegatingMethodAccessorImpl.invoke(DelegatingMethodAccessorImpl.java:43)
      	at java.lang.reflect.Method.invoke(Method.java:498)
      	at org.jboss.arquillian.core.impl.ObserverImpl.invoke(ObserverImpl.java:94)
      	at org.jboss.arquillian.core.impl.EventContextImpl.proceed(EventContextImpl.java:88)
      	at org.jboss.arquillian.test.impl.TestContextHandler.createClassContext(TestContextHandler.java:92)
      	at sun.reflect.NativeMethodAccessorImpl.invoke0(Native Method)
      	at sun.reflect.NativeMethodAccessorImpl.invoke(NativeMethodAccessorImpl.java:62)
      	at sun.reflect.DelegatingMethodAccessorImpl.invoke(DelegatingMethodAccessorImpl.java:43)
      	at java.lang.reflect.Method.invoke(Method.java:498)
      	at org.jboss.arquillian.core.impl.ObserverImpl.invoke(ObserverImpl.java:94)
      	at org.jboss.arquillian.core.impl.EventContextImpl.proceed(EventContextImpl.java:88)
      	at org.jboss.arquillian.test.impl.TestContextHandler.createSuiteContext(TestContextHandler.java:73)
      	at sun.reflect.NativeMethodAccessorImpl.invoke0(Native Method)
      	at sun.reflect.NativeMethodAccessorImpl.invoke(NativeMethodAccessorImpl.java:62)
      	at sun.reflect.DelegatingMethodAccessorImpl.invoke(DelegatingMethodAccessorImpl.java:43)
      	at java.lang.reflect.Method.invoke(Method.java:498)
      	at org.jboss.arquillian.core.impl.ObserverImpl.invoke(ObserverImpl.java:94)
      	at org.jboss.arquillian.core.impl.EventContextImpl.proceed(EventContextImpl.java:88)
      	at org.jboss.arquillian.core.impl.ManagerImpl.fire(ManagerImpl.java:145)
      	at org.jboss.arquillian.core.impl.ManagerImpl.fire(ManagerImpl.java:116)
      	at org.jboss.arquillian.test.impl.EventTestRunnerAdaptor.fireCustomLifecycle(EventTestRunnerAdaptor.java:159)
      	at org.jboss.arquillian.junit.Arquillian$7.evaluate(Arquillian.java:311)
      	at org.junit.runners.ParentRunner.runLeaf(ParentRunner.java:325)
      	at org.junit.runners.BlockJUnit4ClassRunner.runChild(BlockJUnit4ClassRunner.java:78)
      	at org.junit.runners.BlockJUnit4ClassRunner.runChild(BlockJUnit4ClassRunner.java:57)
      	at org.junit.runners.ParentRunner$3.run(ParentRunner.java:290)
      	at org.junit.runners.ParentRunner$1.schedule(ParentRunner.java:71)
      	at org.junit.runners.ParentRunner.runChildren(ParentRunner.java:288)
      	at org.junit.runners.ParentRunner.access$000(ParentRunner.java:58)
      	at org.junit.runners.ParentRunner$2.evaluate(ParentRunner.java:268)
      	at org.jboss.arquillian.junit.Arquillian$2.evaluate(Arquillian.java:204)
      	at org.jboss.arquillian.junit.Arquillian.multiExecute(Arquillian.java:422)
      	at org.jboss.arquillian.junit.Arquillian.access$200(Arquillian.java:54)
      	at org.jboss.arquillian.junit.Arquillian$3.evaluate(Arquillian.java:218)
      	at org.junit.runners.ParentRunner.run(ParentRunner.java:363)
      	at org.jboss.arquillian.junit.Arquillian.run(Arquillian.java:166)
      	at org.junit.runner.JUnitCore.run(JUnitCore.java:137)
      	at org.junit.runner.JUnitCore.run(JUnitCore.java:115)
      	at org.jboss.arquillian.junit.container.JUnitTestRunner.execute(JUnitTestRunner.java:66)
      	at org.jboss.arquillian.protocol.jmx.JMXTestRunner.doRunTestMethod(JMXTestRunner.java:180)
      	at org.jboss.as.arquillian.service.ArquillianService$ExtendedJMXTestRunner.doRunTestMethod(ArquillianService.java:243)
      	at org.jboss.arquillian.protocol.jmx.JMXTestRunner.runTestMethodInternal(JMXTestRunner.java:162)
      	at org.jboss.arquillian.protocol.jmx.JMXTestRunner.runTestMethod(JMXTestRunner.java:141)
      	at org.jboss.as.arquillian.service.ArquillianService$ExtendedJMXTestRunner.runTestMethod(ArquillianService.java:219)
      	at sun.reflect.NativeMethodAccessorImpl.invoke0(Native Method)
      	at sun.reflect.NativeMethodAccessorImpl.invoke(NativeMethodAccessorImpl.java:62)
      	at sun.reflect.DelegatingMethodAccessorImpl.invoke(DelegatingMethodAccessorImpl.java:43)
      	at java.lang.reflect.Method.invoke(Method.java:498)
      	at sun.reflect.misc.Trampoline.invoke(MethodUtil.java:71)
      	at sun.reflect.NativeMethodAccessorImpl.invoke0(Native Method)
      	at sun.reflect.NativeMethodAccessorImpl.invoke(NativeMethodAccessorImpl.java:62)
      	at sun.reflect.DelegatingMethodAccessorImpl.invoke(DelegatingMethodAccessorImpl.java:43)
      	at java.lang.reflect.Method.invoke(Method.java:498)
      	at sun.reflect.misc.MethodUtil.invoke(MethodUtil.java:275)
      	at com.sun.jmx.mbeanserver.StandardMBeanIntrospector.invokeM2(StandardMBeanIntrospector.java:112)
      	at com.sun.jmx.mbeanserver.StandardMBeanIntrospector.invokeM2(StandardMBeanIntrospector.java:46)
      	at com.sun.jmx.mbeanserver.MBeanIntrospector.invokeM(MBeanIntrospector.java:237)
      	at com.sun.jmx.mbeanserver.PerInterface.invoke(PerInterface.java:138)
      	at com.sun.jmx.mbeanserver.MBeanSupport.invoke(MBeanSupport.java:252)
      	at com.sun.jmx.interceptor.DefaultMBeanServerInterceptor.invoke(DefaultMBeanServerInterceptor.java:819)
      	at com.sun.jmx.mbeanserver.JmxMBeanServer.invoke(JmxMBeanServer.java:801)
      	at org.jboss.as.jmx.PluggableMBeanServerImpl$TcclMBeanServer.invoke(PluggableMBeanServerImpl.java:1503)
      	at org.jboss.as.jmx.PluggableMBeanServerImpl.invoke(PluggableMBeanServerImpl.java:724)
      	at org.jboss.as.jmx.BlockingNotificationMBeanServer.invoke(BlockingNotificationMBeanServer.java:168)
      	at org.jboss.remotingjmx.protocol.v2.ServerProxy$InvokeHandler.handle(ServerProxy.java:950)
      	at org.jboss.remotingjmx.protocol.v2.ServerCommon$MessageReciever$1$1.run(ServerCommon.java:153)
      	at org.jboss.as.jmx.ServerInterceptorFactory$Interceptor$1.run(ServerInterceptorFactory.java:75)
      	at org.jboss.as.jmx.ServerInterceptorFactory$Interceptor$1.run(ServerInterceptorFactory.java:70)
      	at java.security.AccessController.doPrivileged(Native Method)
      	at javax.security.auth.Subject.doAs(Subject.java:422)
      	at org.jboss.as.controller.AccessAuditContext.doAs(AccessAuditContext.java:149)
      	at org.jboss.as.jmx.ServerInterceptorFactory$Interceptor.handleEvent(ServerInterceptorFactory.java:70)
      	at org.jboss.remotingjmx.protocol.v2.ServerCommon$MessageReciever$1.run(ServerCommon.java:149)
      	at java.util.concurrent.ThreadPoolExecutor.runWorker(ThreadPoolExecutor.java:1142)
      	at java.util.concurrent.ThreadPoolExecutor$Worker.run(ThreadPoolExecutor.java:617)
      	at java.lang.Thread.run(Thread.java:745)
      

      Tests failing on cleanUp() method:

      • org.jboss.as.test.integration.ejb.servlet.ServletUnitTestCase#testEJBServlet
      • org.jboss.as.test.integration.ejb.servlet.ServletUnitTestCase#testEJBServletEar

      ./integration-tests.sh -DtestLogToFile=false -Dts.noSmoke -Dts.basic -Dtest=ServletUnitTestCase -Dsecurity.manager

      ERROR [org.jboss.as.test.integration.ejb.servlet.EJBServlet] (default task-1) java.security.AccessControlException: WFSM000001: Permission check failed (permission "("java.lang.RuntimePermission" "org.jboss.security.getSecurityContext")" in code source "(vfs:/content/ejb3-servlet.war/WEB-INF/classes <no signer certificates>)" of "ModuleClassLoader for Module "deployment.ejb3-servlet.war:main" from Service Module Loader")
      15:07:52,122 ERROR [io.undertow.request] (default task-1) UT005023: Exception handling request to /ejb3-servlet/EJBServlet: java.security.AccessControlException: WFSM000001: Permission check failed (permission "("java.lang.RuntimePermission" "org.jboss.security.setSecurityContext")" in code source "(vfs:/content/ejb3-servlet.war/WEB-INF/classes <no signer certificates>)" of "ModuleClassLoader for Module "deployment.ejb3-servlet.war:main" from Service Module Loader")
      	at org.wildfly.security.manager.WildFlySecurityManager.checkPermission(WildFlySecurityManager.java:278)
      	at org.wildfly.security.manager.WildFlySecurityManager.checkPermission(WildFlySecurityManager.java:175)
      	at org.jboss.security.SecurityContextAssociation.setSecurityContext(SecurityContextAssociation.java:124)
      	at org.jboss.security.client.JBossSecurityClient.cleanUp(JBossSecurityClient.java:95)
      	at org.jboss.security.client.SecurityClient.logout(SecurityClient.java:86)
      	at org.jboss.as.test.integration.ejb.servlet.EJBServlet.processRequest(EJBServlet.java:75)
      	at org.jboss.as.test.integration.ejb.servlet.EJBServlet.doGet(EJBServlet.java:84)
      	at javax.servlet.http.HttpServlet.service(HttpServlet.java:687)
      	at javax.servlet.http.HttpServlet.service(HttpServlet.java:790)
      	at io.undertow.servlet.handlers.ServletHandler.handleRequest(ServletHandler.java:85)
      	at io.undertow.servlet.handlers.security.ServletSecurityRoleHandler.handleRequest(ServletSecurityRoleHandler.java:62)
      	at io.undertow.servlet.handlers.ServletDispatchingHandler.handleRequest(ServletDispatchingHandler.java:36)
      	at org.wildfly.extension.undertow.security.SecurityContextAssociationHandler.handleRequest(SecurityContextAssociationHandler.java:78)
      	at io.undertow.server.handlers.PredicateHandler.handleRequest(PredicateHandler.java:43)
      	at io.undertow.servlet.handlers.security.SSLInformationAssociationHandler.handleRequest(SSLInformationAssociationHandler.java:131)
      	at io.undertow.servlet.handlers.security.ServletAuthenticationCallHandler.handleRequest(ServletAuthenticationCallHandler.java:57)
      	at io.undertow.server.handlers.PredicateHandler.handleRequest(PredicateHandler.java:43)
      	at io.undertow.security.handlers.AbstractConfidentialityHandler.handleRequest(AbstractConfidentialityHandler.java:46)
      	at io.undertow.servlet.handlers.security.ServletConfidentialityConstraintHandler.handleRequest(ServletConfidentialityConstraintHandler.java:64)
      	at io.undertow.security.handlers.AuthenticationMechanismsHandler.handleRequest(AuthenticationMechanismsHandler.java:60)
      	at io.undertow.servlet.handlers.security.CachedAuthenticatedSessionHandler.handleRequest(CachedAuthenticatedSessionHandler.java:77)
      	at io.undertow.security.handlers.NotificationReceiverHandler.handleRequest(NotificationReceiverHandler.java:50)
      	at io.undertow.security.handlers.AbstractSecurityContextAssociationHandler.handleRequest(AbstractSecurityContextAssociationHandler.java:43)
      	at io.undertow.server.handlers.PredicateHandler.handleRequest(PredicateHandler.java:43)
      	at org.wildfly.extension.undertow.security.jacc.JACCContextIdHandler.handleRequest(JACCContextIdHandler.java:61)
      	at io.undertow.server.handlers.PredicateHandler.handleRequest(PredicateHandler.java:43)
      	at io.undertow.server.handlers.PredicateHandler.handleRequest(PredicateHandler.java:43)
      	at io.undertow.servlet.handlers.ServletInitialHandler.handleFirstRequest(ServletInitialHandler.java:292)
      	at io.undertow.servlet.handlers.ServletInitialHandler.access$100(ServletInitialHandler.java:81)
      	at io.undertow.servlet.handlers.ServletInitialHandler$2.call(ServletInitialHandler.java:138)
      	at io.undertow.servlet.handlers.ServletInitialHandler$2.call(ServletInitialHandler.java:135)
      	at io.undertow.servlet.core.ServletRequestContextThreadSetupAction$1.call(ServletRequestContextThreadSetupAction.java:48)
      	at io.undertow.servlet.core.ContextClassLoaderSetupAction$1.call(ContextClassLoaderSetupAction.java:43)
      	at org.wildfly.extension.undertow.security.SecurityContextThreadSetupAction.lambda$create$0(SecurityContextThreadSetupAction.java:105)
      	at org.wildfly.extension.undertow.deployment.UndertowDeploymentInfoService$UndertowThreadSetupAction.lambda$create$0(UndertowDeploymentInfoService.java:1668)
      	at org.wildfly.extension.undertow.deployment.UndertowDeploymentInfoService$UndertowThreadSetupAction.lambda$create$0(UndertowDeploymentInfoService.java:1668)
      	at org.wildfly.extension.undertow.deployment.UndertowDeploymentInfoService$UndertowThreadSetupAction.lambda$create$0(UndertowDeploymentInfoService.java:1668)
      	at org.wildfly.extension.undertow.deployment.UndertowDeploymentInfoService$UndertowThreadSetupAction.lambda$create$0(UndertowDeploymentInfoService.java:1668)
      	at io.undertow.servlet.handlers.ServletInitialHandler.dispatchRequest(ServletInitialHandler.java:272)
      	at io.undertow.servlet.handlers.ServletInitialHandler.access$000(ServletInitialHandler.java:81)
      	at io.undertow.servlet.handlers.ServletInitialHandler$1$1.run(ServletInitialHandler.java:110)
      	at java.security.AccessController.doPrivileged(Native Method)
      	at io.undertow.servlet.handlers.ServletInitialHandler$1.handleRequest(ServletInitialHandler.java:107)
      	at io.undertow.server.Connectors.executeRootHandler(Connectors.java:207)
      	at io.undertow.server.HttpServerExchange$1.run(HttpServerExchange.java:810)
      	at java.util.concurrent.ThreadPoolExecutor.runWorker(ThreadPoolExecutor.java:1142)
      	at java.util.concurrent.ThreadPoolExecutor$Worker.run(ThreadPoolExecutor.java:617)
      	at java.lang.Thread.run(Thread.java:745)
      

      [1] https://github.com/wildfly/wildfly-core/pull/1764/files
      [2] https://github.com/picketbox/picketbox/blob/v4.9.6.Final/security-jboss-sx/jbosssx/src/main/java/org/jboss/security/client/JBossSecurityClient.java
      [3] https://github.com/picketbox/picketbox/blob/5.0.0.Alpha3/security-jboss-sx/jbosssx/src/main/java/org/jboss/security/client/JBossSecurityClient.java

        Gliffy Diagrams

          Attachments

            Issue Links

              Activity

                People

                • Assignee:
                  dlofthouse Darran Lofthouse
                  Reporter:
                  jtymel Jan Tymel
                • Votes:
                  0 Vote for this issue
                  Watchers:
                  1 Start watching this issue

                  Dates

                  • Created:
                    Updated:
                    Resolved: