-
Bug
-
Resolution: Unresolved
-
Normal
-
rhel-10.1
-
None
-
udisks2-2.11.0-1.el10
-
No
-
Low
-
rhel-storage-management
-
ssg_platform_storage
-
15
-
16
-
1
-
Dev ack
-
False
-
False
-
-
No
-
Red Hat Enterprise Linux
-
None
-
Pass
-
RegressionOnly
-
Unspecified Release Note Type - Unknown
-
Unspecified
-
Unspecified
-
Unspecified
-
None
test_format_ns (test_nvme.UdisksNVMeTest.test_format_ns) ... ok test_health_info (test_nvme.UdisksNVMeTest.test_health_info) ... ok test_hostnqn (test_nvme.UdisksNVMeTest.test_hostnqn) ... ok test_namespace_info (test_nvme.UdisksNVMeTest.test_namespace_info) ... ok test_persistent_dc (test_nvme.UdisksNVMeTest.test_persistent_dc) ... ok test_sanitize (test_nvme.UdisksNVMeTest.test_sanitize) ... ok ====================================================================== FAIL: test_controller_info (test_nvme.UdisksNVMeTest.test_controller_info) ---------------------------------------------------------------------- Traceback (most recent call last): File "/root/rpmbuild/BUILD/udisks-2.10.90/src/tests/dbus-tests/test_nvme.py", line 277, in test_controller_info self.assertTrue(rev.startswith('1.')) AssertionError: False is not true ---------------------------------------------------------------------- Ran 299 tests in 780.236s FAILED (failures=1, skipped=109) All configuration cleared
https://beaker.engineering.redhat.com/recipes/18678451#task194851436
- depends on
-
RHEL-114981 Update udisks2 to the latest upstream release
-
- Release Pending
-
- links to
-
RHBA-2025:156117
udisks2 update