Uploaded image for project: 'Kogito'
  1. Kogito
  2. KOGITO-5343

BPMN project build problem on Windows (no such file: /META-INF/jsonSchema)

    XMLWordPrintable

Details

    • Bug
    • Status: Resolved (View Workflow)
    • Major
    • Resolution: Done
    • 1.7.0.Final
    • 1.11.0.Final
    • Core
    • None

    Description

      Full discussion in https://groups.google.com/forum/?utm_medium=email&utm_source=footer#!msg/kogito-development/HgvdorhdUjM/jey9euYAAgAJ
       
      [ERROR] Failed to execute goal io.quarkus:quarkus-maven-plugin:1.13.3.Final:build (default) on project swing-process: Failed to build quarkus application: io.quarkus.builder.BuildException: Build failure: Build failed due to errors
      [ERROR]         [error]: Build step io.quarkus.deployment.pkg.steps.JarResultBuildStep#buildRunnerJar threw an exception: java.lang.IllegalStateException: java.nio.file.NoSuchFileException: /META-INF/jsonSchema
      [ERROR]         at io.quarkus.deployment.ExtensionLoader$2.execute(ExtensionLoader.java:929)
      [ERROR]         at io.quarkus.builder.BuildContext.run(BuildContext.java:277)
      [ERROR]         at org.jboss.threads.EnhancedQueueExecutor$Task.run(EnhancedQueueExecutor.java:2415)
      [ERROR]         at org.jboss.threads.EnhancedQueueExecutor$ThreadBody.run(EnhancedQueueExecutor.java:1452)
      [ERROR]         at jdk.zipfs/jdk.nio.zipfs.ZipFileSystem.checkParents(ZipFileSystem.java:888)
      [ERROR]         at jdk.zipfs/jdk.nio.zipfs.ZipFileSystem.newOutputStream(ZipFileSystem.java:575)
      [ERROR]         at jdk.zipfs/jdk.nio.zipfs.ZipPath.newOutputStream(ZipPath.java:861)
      [ERROR]         at jdk.zipfs/jdk.nio.zipfs.ZipFileSystemProvider.newOutputStream(ZipFileSystemProvider.java:282)
      [ERROR]         at java.base/java.nio.file.Files.newOutputStream(Files.java:220)
      [ERROR]         at io.quarkus.deployment.pkg.steps.JarResultBuildStep.copyCommonContent(JarResultBuildStep.java:1083)
      [ERROR]         at io.quarkus.deployment.pkg.steps.JarResultBuildStep.buildUberJar0(JarResultBuildStep.java:349)
      [ERROR]         at io.quarkus.deployment.pkg.steps.JarResultBuildStep.buildUberJar(JarResultBuildStep.java:265)
      [ERROR]         at io.quarkus.deployment.pkg.steps.JarResultBuildStep.buildRunnerJar(JarResultBuildStep.java:208)
      [ERROR]         at java.base/jdk.internal.reflect.NativeMethodAccessorImpl.invoke0(Native Method)
      [ERROR]         at java.base/jdk.internal.reflect.NativeMethodAccessorImpl.invoke(NativeMethodAccessorImpl.java:62)
      [ERROR]         at java.base/jdk.internal.reflect.DelegatingMethodAccessorImpl.invoke(DelegatingMethodAccessorImpl.java:43)
      [ERROR]         at java.base/java.lang.reflect.Method.invoke(Method.java:566)
      [ERROR]         at io.quarkus.deployment.ExtensionLoader$2.execute(ExtensionLoader.java:920)
      [ERROR]         ... 5 more
      [ERROR] -> [Help 1]

      Attachments

        Activity

          People

            ftirados Francisco Javier Tirado Sarti
            cnicolai@redhat.com Cristiano Nicolai
            Marian Macik Marian Macik
            Votes:
            1 Vote for this issue
            Watchers:
            3 Start watching this issue

            Dates

              Created:
              Updated:
              Resolved: