Details

      Description

      -------------------------------------------------------------------------------
      Test set: org.jboss.narayana.quickstart.jca.model.CustomerDAOTest
      -------------------------------------------------------------------------------
      Tests run: 2, Failures: 0, Errors: 2, Skipped: 0, Time elapsed: 1.125 sec <<< FAILURE!
      org.jboss.narayana.quickstart.jca.model.CustomerDAOTest  Time elapsed: 0 sec  <<< ERROR!
      com.github.fungal.spi.deployers.DeployException: Deployment file:/C:/hudson/workspace/narayana-quickstarts-catelyn/jca-and-tomcat/target/classes/transaction.xml failed
      	at com.github.fungal.impl.DeploymentDeployer.deploy(DeploymentDeployer.java:157)
      	at com.github.fungal.impl.MainDeployerImpl.deploy(MainDeployerImpl.java:144)
      	at com.github.fungal.impl.MainDeployerImpl.deploy(MainDeployerImpl.java:82)
      	at org.jboss.jca.embedded.EmbeddedJCA.deploy(EmbeddedJCA.java:313)
      	at org.jboss.jca.embedded.EmbeddedJCA.startup(EmbeddedJCA.java:122)
      	at org.jboss.narayana.quickstart.jca.common.AbstractTest.beforeClass(AbstractTest.java:52)
      	at sun.reflect.NativeMethodAccessorImpl.invoke0(Native Method)
      	at sun.reflect.NativeMethodAccessorImpl.invoke(NativeMethodAccessorImpl.java:62)
      	at sun.reflect.DelegatingMethodAccessorImpl.invoke(DelegatingMethodAccessorImpl.java:43)
      	at java.lang.reflect.Method.invoke(Method.java:497)
      	at org.junit.runners.model.FrameworkMethod$1.runReflectiveCall(FrameworkMethod.java:45)
      	at org.junit.internal.runners.model.ReflectiveCallable.run(ReflectiveCallable.java:15)
      	at org.junit.runners.model.FrameworkMethod.invokeExplosively(FrameworkMethod.java:42)
      	at org.junit.internal.runners.statements.RunBefores.evaluate(RunBefores.java:27)
      	at org.junit.internal.runners.statements.RunAfters.evaluate(RunAfters.java:30)
      	at org.junit.runners.ParentRunner.run(ParentRunner.java:300)
      	at org.apache.maven.surefire.junit4.JUnit4TestSet.execute(JUnit4TestSet.java:35)
      	at org.apache.maven.surefire.junit4.JUnit4Provider.executeTestSet(JUnit4Provider.java:115)
      	at org.apache.maven.surefire.junit4.JUnit4Provider.invoke(JUnit4Provider.java:97)
      	at sun.reflect.NativeMethodAccessorImpl.invoke0(Native Method)
      	at sun.reflect.NativeMethodAccessorImpl.invoke(NativeMethodAccessorImpl.java:62)
      	at sun.reflect.DelegatingMethodAccessorImpl.invoke(DelegatingMethodAccessorImpl.java:43)
      	at java.lang.reflect.Method.invoke(Method.java:497)
      	at org.apache.maven.surefire.booter.ProviderFactory$ClassLoaderProxy.invoke(ProviderFactory.java:103)
      	at com.sun.proxy.$Proxy0.invoke(Unknown Source)
      	at org.apache.maven.surefire.booter.SurefireStarter.invokeProvider(SurefireStarter.java:150)
      	at org.apache.maven.surefire.booter.SurefireStarter.runSuitesInProcess(SurefireStarter.java:91)
      	at org.apache.maven.surefire.booter.ForkedBooter.main(ForkedBooter.java:69)
      Caused by: com.github.fungal.spi.deployers.DeployException: Installing bean XATerminator
      	at com.github.fungal.impl.BeanDeployer.run(BeanDeployer.java:200)
      	at java.util.concurrent.Executors$RunnableAdapter.call(Executors.java:511)
      	at java.util.concurrent.FutureTask.run(FutureTask.java:266)
      	at java.util.concurrent.ThreadPoolExecutor.runWorker(ThreadPoolExecutor.java:1142)
      	at java.util.concurrent.ThreadPoolExecutor$Worker.run(ThreadPoolExecutor.java:617)
      	at java.lang.Thread.run(Thread.java:745)
      Caused by: java.lang.NoClassDefFoundError: org/jboss/tm/ExtendedJBossXATerminator
      	at java.lang.ClassLoader.defineClass1(Native Method)
      	at java.lang.ClassLoader.defineClass(ClassLoader.java:760)
      	at java.security.SecureClassLoader.defineClass(SecureClassLoader.java:142)
      	at java.net.URLClassLoader.defineClass(URLClassLoader.java:467)
      	at java.net.URLClassLoader.access$100(URLClassLoader.java:73)
      	at java.net.URLClassLoader$1.run(URLClassLoader.java:368)
      	at java.net.URLClassLoader$1.run(URLClassLoader.java:362)
      	at java.security.AccessController.doPrivileged(Native Method)
      	at java.net.URLClassLoader.findClass(URLClassLoader.java:361)
      	at java.lang.ClassLoader.loadClass(ClassLoader.java:424)
      	at sun.misc.Launcher$AppClassLoader.loadClass(Launcher.java:331)
      	at java.lang.ClassLoader.loadClass(ClassLoader.java:357)
      	at com.github.fungal.impl.classloader.ParentFirstClassLoader.loadClass(ParentFirstClassLoader.java:67)
      	at java.lang.Class.forName0(Native Method)
      	at java.lang.Class.forName(Class.java:348)
      	at com.github.fungal.impl.BeanDeployer.createBean(BeanDeployer.java:318)
      	at com.github.fungal.impl.BeanDeployer.run(BeanDeployer.java:186)
      	... 5 more
      Caused by: java.lang.ClassNotFoundException: org.jboss.tm.ExtendedJBossXATerminator
      	at java.net.URLClassLoader.findClass(URLClassLoader.java:381)
      	at java.lang.ClassLoader.loadClass(ClassLoader.java:424)
      	at sun.misc.Launcher$AppClassLoader.loadClass(Launcher.java:331)
      	at java.lang.ClassLoader.loadClass(ClassLoader.java:357)
      	... 22 more
      
      org.jboss.narayana.quickstart.jca.model.CustomerDAOTest  Time elapsed: 0 sec  <<< ERROR!
      java.lang.IllegalStateException: Container not started
      	at org.jboss.jca.embedded.EmbeddedJCA.undeploy(EmbeddedJCA.java:327)
      	at org.jboss.narayana.quickstart.jca.common.AbstractTest.afterClass(AbstractTest.java:59)
      	at sun.reflect.NativeMethodAccessorImpl.invoke0(Native Method)
      	at sun.reflect.NativeMethodAccessorImpl.invoke(NativeMethodAccessorImpl.java:62)
      	at sun.reflect.DelegatingMethodAccessorImpl.invoke(DelegatingMethodAccessorImpl.java:43)
      	at java.lang.reflect.Method.invoke(Method.java:497)
      	at org.junit.runners.model.FrameworkMethod$1.runReflectiveCall(FrameworkMethod.java:45)
      	at org.junit.internal.runners.model.ReflectiveCallable.run(ReflectiveCallable.java:15)
      	at org.junit.runners.model.FrameworkMethod.invokeExplosively(FrameworkMethod.java:42)
      	at org.junit.internal.runners.statements.RunAfters.evaluate(RunAfters.java:36)
      	at org.junit.runners.ParentRunner.run(ParentRunner.java:300)
      	at org.apache.maven.surefire.junit4.JUnit4TestSet.execute(JUnit4TestSet.java:35)
      	at org.apache.maven.surefire.junit4.JUnit4Provider.executeTestSet(JUnit4Provider.java:115)
      	at org.apache.maven.surefire.junit4.JUnit4Provider.invoke(JUnit4Provider.java:97)
      	at sun.reflect.NativeMethodAccessorImpl.invoke0(Native Method)
      	at sun.reflect.NativeMethodAccessorImpl.invoke(NativeMethodAccessorImpl.java:62)
      	at sun.reflect.DelegatingMethodAccessorImpl.invoke(DelegatingMethodAccessorImpl.java:43)
      	at java.lang.reflect.Method.invoke(Method.java:497)
      	at org.apache.maven.surefire.booter.ProviderFactory$ClassLoaderProxy.invoke(ProviderFactory.java:103)
      	at com.sun.proxy.$Proxy0.invoke(Unknown Source)
      	at org.apache.maven.surefire.booter.SurefireStarter.invokeProvider(SurefireStarter.java:150)
      	at org.apache.maven.surefire.booter.SurefireStarter.runSuitesInProcess(SurefireStarter.java:91)
      	at org.apache.maven.surefire.booter.ForkedBooter.main(ForkedBooter.java:69)
      
      -------------------------------------------------------------------------------
      Test set: org.jboss.narayana.quickstart.jca.xa.XAResourcesTest
      -------------------------------------------------------------------------------
      Tests run: 2, Failures: 0, Errors: 2, Skipped: 0, Time elapsed: 0.047 sec <<< FAILURE!
      org.jboss.narayana.quickstart.jca.xa.XAResourcesTest  Time elapsed: 0.079 sec  <<< ERROR!
      com.github.fungal.spi.deployers.DeployException: Deployment file:/C:/hudson/workspace/narayana-quickstarts-catelyn/jca-and-tomcat/target/classes/transaction.xml failed
      	at com.github.fungal.impl.DeploymentDeployer.deploy(DeploymentDeployer.java:157)
      	at com.github.fungal.impl.MainDeployerImpl.deploy(MainDeployerImpl.java:144)
      	at com.github.fungal.impl.MainDeployerImpl.deploy(MainDeployerImpl.java:82)
      	at org.jboss.jca.embedded.EmbeddedJCA.deploy(EmbeddedJCA.java:313)
      	at org.jboss.jca.embedded.EmbeddedJCA.startup(EmbeddedJCA.java:122)
      	at org.jboss.narayana.quickstart.jca.common.AbstractTest.beforeClass(AbstractTest.java:52)
      	at sun.reflect.NativeMethodAccessorImpl.invoke0(Native Method)
      	at sun.reflect.NativeMethodAccessorImpl.invoke(NativeMethodAccessorImpl.java:62)
      	at sun.reflect.DelegatingMethodAccessorImpl.invoke(DelegatingMethodAccessorImpl.java:43)
      	at java.lang.reflect.Method.invoke(Method.java:497)
      	at org.junit.runners.model.FrameworkMethod$1.runReflectiveCall(FrameworkMethod.java:45)
      	at org.junit.internal.runners.model.ReflectiveCallable.run(ReflectiveCallable.java:15)
      	at org.junit.runners.model.FrameworkMethod.invokeExplosively(FrameworkMethod.java:42)
      	at org.junit.internal.runners.statements.RunBefores.evaluate(RunBefores.java:27)
      	at org.junit.internal.runners.statements.RunAfters.evaluate(RunAfters.java:30)
      	at org.junit.runners.ParentRunner.run(ParentRunner.java:300)
      	at org.apache.maven.surefire.junit4.JUnit4TestSet.execute(JUnit4TestSet.java:35)
      	at org.apache.maven.surefire.junit4.JUnit4Provider.executeTestSet(JUnit4Provider.java:115)
      	at org.apache.maven.surefire.junit4.JUnit4Provider.invoke(JUnit4Provider.java:97)
      	at sun.reflect.NativeMethodAccessorImpl.invoke0(Native Method)
      	at sun.reflect.NativeMethodAccessorImpl.invoke(NativeMethodAccessorImpl.java:62)
      	at sun.reflect.DelegatingMethodAccessorImpl.invoke(DelegatingMethodAccessorImpl.java:43)
      	at java.lang.reflect.Method.invoke(Method.java:497)
      	at org.apache.maven.surefire.booter.ProviderFactory$ClassLoaderProxy.invoke(ProviderFactory.java:103)
      	at com.sun.proxy.$Proxy0.invoke(Unknown Source)
      	at org.apache.maven.surefire.booter.SurefireStarter.invokeProvider(SurefireStarter.java:150)
      	at org.apache.maven.surefire.booter.SurefireStarter.runSuitesInProcess(SurefireStarter.java:91)
      	at org.apache.maven.surefire.booter.ForkedBooter.main(ForkedBooter.java:69)
      Caused by: com.github.fungal.spi.deployers.DeployException: Installing bean XATerminator
      	at com.github.fungal.impl.BeanDeployer.run(BeanDeployer.java:200)
      	at java.util.concurrent.Executors$RunnableAdapter.call(Executors.java:511)
      	at java.util.concurrent.FutureTask.run(FutureTask.java:266)
      	at java.util.concurrent.ThreadPoolExecutor.runWorker(ThreadPoolExecutor.java:1142)
      	at java.util.concurrent.ThreadPoolExecutor$Worker.run(ThreadPoolExecutor.java:617)
      	at java.lang.Thread.run(Thread.java:745)
      Caused by: java.lang.NoClassDefFoundError: org/jboss/tm/ExtendedJBossXATerminator
      	at java.lang.ClassLoader.defineClass1(Native Method)
      	at java.lang.ClassLoader.defineClass(ClassLoader.java:760)
      	at java.security.SecureClassLoader.defineClass(SecureClassLoader.java:142)
      	at java.net.URLClassLoader.defineClass(URLClassLoader.java:467)
      	at java.net.URLClassLoader.access$100(URLClassLoader.java:73)
      	at java.net.URLClassLoader$1.run(URLClassLoader.java:368)
      	at java.net.URLClassLoader$1.run(URLClassLoader.java:362)
      	at java.security.AccessController.doPrivileged(Native Method)
      	at java.net.URLClassLoader.findClass(URLClassLoader.java:361)
      	at java.lang.ClassLoader.loadClass(ClassLoader.java:424)
      	at sun.misc.Launcher$AppClassLoader.loadClass(Launcher.java:331)
      	at java.lang.ClassLoader.loadClass(ClassLoader.java:357)
      	at com.github.fungal.impl.classloader.ParentFirstClassLoader.loadClass(ParentFirstClassLoader.java:67)
      	at com.github.fungal.impl.classloader.ParentFirstClassLoader.loadClass(ParentFirstClassLoader.java:67)
      	at java.lang.Class.forName0(Native Method)
      	at java.lang.Class.forName(Class.java:348)
      	at com.github.fungal.impl.BeanDeployer.createBean(BeanDeployer.java:318)
      	at com.github.fungal.impl.BeanDeployer.run(BeanDeployer.java:186)
      	... 5 more
      Caused by: java.lang.ClassNotFoundException: org.jboss.tm.ExtendedJBossXATerminator
      	at java.net.URLClassLoader.findClass(URLClassLoader.java:381)
      	at java.lang.ClassLoader.loadClass(ClassLoader.java:424)
      	at sun.misc.Launcher$AppClassLoader.loadClass(Launcher.java:331)
      	at java.lang.ClassLoader.loadClass(ClassLoader.java:357)
      	... 23 more
      
      org.jboss.narayana.quickstart.jca.xa.XAResourcesTest  Time elapsed: 0.079 sec  <<< ERROR!
      java.lang.IllegalStateException: Container not started
      	at org.jboss.jca.embedded.EmbeddedJCA.undeploy(EmbeddedJCA.java:327)
      	at org.jboss.narayana.quickstart.jca.common.AbstractTest.afterClass(AbstractTest.java:59)
      	at sun.reflect.NativeMethodAccessorImpl.invoke0(Native Method)
      	at sun.reflect.NativeMethodAccessorImpl.invoke(NativeMethodAccessorImpl.java:62)
      	at sun.reflect.DelegatingMethodAccessorImpl.invoke(DelegatingMethodAccessorImpl.java:43)
      	at java.lang.reflect.Method.invoke(Method.java:497)
      	at org.junit.runners.model.FrameworkMethod$1.runReflectiveCall(FrameworkMethod.java:45)
      	at org.junit.internal.runners.model.ReflectiveCallable.run(ReflectiveCallable.java:15)
      	at org.junit.runners.model.FrameworkMethod.invokeExplosively(FrameworkMethod.java:42)
      	at org.junit.internal.runners.statements.RunAfters.evaluate(RunAfters.java:36)
      	at org.junit.runners.ParentRunner.run(ParentRunner.java:300)
      	at org.apache.maven.surefire.junit4.JUnit4TestSet.execute(JUnit4TestSet.java:35)
      	at org.apache.maven.surefire.junit4.JUnit4Provider.executeTestSet(JUnit4Provider.java:115)
      	at org.apache.maven.surefire.junit4.JUnit4Provider.invoke(JUnit4Provider.java:97)
      	at sun.reflect.NativeMethodAccessorImpl.invoke0(Native Method)
      	at sun.reflect.NativeMethodAccessorImpl.invoke(NativeMethodAccessorImpl.java:62)
      	at sun.reflect.DelegatingMethodAccessorImpl.invoke(DelegatingMethodAccessorImpl.java:43)
      	at java.lang.reflect.Method.invoke(Method.java:497)
      	at org.apache.maven.surefire.booter.ProviderFactory$ClassLoaderProxy.invoke(ProviderFactory.java:103)
      	at com.sun.proxy.$Proxy0.invoke(Unknown Source)
      	at org.apache.maven.surefire.booter.SurefireStarter.invokeProvider(SurefireStarter.java:150)
      	at org.apache.maven.surefire.booter.SurefireStarter.runSuitesInProcess(SurefireStarter.java:91)
      	at org.apache.maven.surefire.booter.ForkedBooter.main(ForkedBooter.java:69)
      

        Gliffy Diagrams

          Attachments

            Issue Links

              Activity

                People

                • Assignee:
                  mmusgrov Michael Musgrove
                  Reporter:
                  gytis Gytis Trikleris
                • Votes:
                  0 Vote for this issue
                  Watchers:
                  2 Start watching this issue

                  Dates

                  • Created:
                    Updated:
                    Resolved: