Uploaded image for project: 'JBoss Transaction Manager'
  1. JBoss Transaction Manager
  2. JBTM-2085

blacktie-admin-services test failed with the connection timeout to remote://localhost:9999

    Details

    • Type: Bug
    • Status: Closed (View Workflow)
    • Priority: Major
    • Resolution: Done
    • Affects Version/s: None
    • Fix Version/s: 5.0.1
    • Component/s: BlackTie
    • Labels:
      None

      Description

      http://172.17.131.2/view/Narayana+BlackTie/job/narayana-windows2008-taconic/525/consoleText

      Running AdvertiseUnadvertiseTest
      18:31:04,543 INFO  [org.jboss.as.repository] (management-handler-thread - 1) JBAS014900: Content added at location C:\hudson\workspace\narayana-windows2008-taconic\blacktie\wildfly-8.0.0.Final-SNAPSHOT\standalone\data\content\22\88761be679276672f72e33848acde196874007\content
      18:31:04,570 INFO  [org.jboss.as.server.deployment] (MSC service thread 1-1) JBAS015876: Starting deployment of "test.war" (runtime-name: "test.war")
      18:31:05,070 WARN  [org.jboss.as.dependency.private] (MSC service thread 1-2) JBAS018567: Deployment "deployment.test.war" is using a private module ("org.jboss.jts:main") which may be changed or removed in future versions without notice.
      18:31:05,348 WARN  [org.jboss.weld.deployer] (MSC service thread 1-2) JBAS016012: Deployment deployment "test.war" contains CDI annotations but no bean archive was not found. (No beans.xml nor class with bean defining annotations)
      18:31:05,571 INFO  [org.jboss.as.ejb3] (MSC service thread 1-1) JBAS014142: Started message driven bean 'BlacktieStompAdministrationService' with 'hornetq-ra.rar' resource adapter
      18:31:05,821 INFO  [org.hornetq.ra] (default-threads - 1) HQ151000: awaiting topic/queue creation queue/BTR_BTStompAdmin
      18:31:06,406 INFO  [org.wildfly.extension.undertow] (MSC service thread 1-1) JBAS017534: Register web context: /test
      18:31:06,489 INFO  [org.jboss.as.server] (management-handler-thread - 1) JBAS018559: Deployed "test.war" (runtime-name : "test.war")
      18:31:08,426 INFO  [org.jboss.arquillian.testenricher.cdi.container.BeanManagerProducer] (default task-1) BeanManager not found.
      18:31:08,461 INFO  [AdvertiseUnadvertiseTest] (default task-1) Got the service
      18:31:08,461 INFO  [AdvertiseUnadvertiseTest] (default task-1) Got the exception
      18:31:08,477 INFO  [org.hornetq.ra] (default-threads - 1) HQ151001: Attempting to reconnect org.hornetq.ra.inflow.HornetQActivationSpec(ra=org.hornetq.ra.HornetQResourceAdapter@18772a5 destination=queue/BTR_BTStompAdmin destinationType=javax.jms.Queue ack=Auto-acknowledge durable=false clientID=null user=null maxSession=15)
      18:31:37,780 ERROR [org.jboss.narayana.blacktie.administration.BlacktieStompAdministrationService] (default task-1) Could not deploy queue of .testsui1: java.io.IOException: java.net.ConnectException: JBAS012144: Could not connect to remote://localhost:9999. The connection timed out
      	at org.jboss.as.controller.client.impl.AbstractModelControllerClient.executeForResult(AbstractModelControllerClient.java:129) [wildfly-controller-client-8.0.0.Final-SNAPSHOT.jar:8.0.0.Final-SNAPSHOT]
      	at org.jboss.as.controller.client.impl.AbstractModelControllerClient.execute(AbstractModelControllerClient.java:76) [wildfly-controller-client-8.0.0.Final-SNAPSHOT.jar:8.0.0.Final-SNAPSHOT]
      	at org.jboss.narayana.blacktie.administration.BlacktieStompAdministrationService.applyUpdate(BlacktieStompAdministrationService.java:94) [classes:]
      	at org.jboss.narayana.blacktie.administration.BlacktieStompAdministrationService.deployQueue(BlacktieStompAdministrationService.java:294) [classes:]
      	at AdvertiseUnadvertiseTest.testAdvertiseUnadvertise(AdvertiseUnadvertiseTest.java:63)	at sun.reflect.NativeMethodAccessorImpl.invoke0(Native Method) [rt.jar:1.7.0_51]
      	at sun.reflect.NativeMethodAccessorImpl.invoke(NativeMethodAccessorImpl.java:57) [rt.jar:1.7.0_51]
      	at sun.reflect.DelegatingMethodAccessorImpl.invoke(DelegatingMethodAccessorImpl.java:43) [rt.jar:1.7.0_51]
      	at java.lang.reflect.Method.invoke(Method.java:606) [rt.jar:1.7.0_51]
      	at org.junit.runners.model.FrameworkMethod$1.runReflectiveCall(FrameworkMethod.java:47) [arquillian-junit.jar:]
      	at org.junit.internal.runners.model.ReflectiveCallable.run(ReflectiveCallable.java:12) [arquillian-junit.jar:]
      	at org.junit.runners.model.FrameworkMethod.invokeExplosively(FrameworkMethod.java:44) [arquillian-junit.jar:]
      	at org.jboss.arquillian.junit.Arquillian$6$1.invoke(Arquillian.java:270) [arquillian-junit.jar:]
      	at org.jboss.arquillian.container.test.impl.execution.LocalTestExecuter.execute(LocalTestExecuter.java:60) [arquillian-core.jar:]
      	at sun.reflect.NativeMethodAccessorImpl.invoke0(Native Method) [rt.jar:1.7.0_51]
      	at sun.reflect.NativeMethodAccessorImpl.invoke(NativeMethodAccessorImpl.java:57) [rt.jar:1.7.0_51]
      	at sun.reflect.DelegatingMethodAccessorImpl.invoke(DelegatingMethodAccessorImpl.java:43) [rt.jar:1.7.0_51]
      	at java.lang.reflect.Method.invoke(Method.java:606) [rt.jar:1.7.0_51]
      	at org.jboss.arquillian.core.impl.ObserverImpl.invoke(ObserverImpl.java:94) [arquillian-core.jar:]
      	at org.jboss.arquillian.core.impl.EventContextImpl.invokeObservers(EventContextImpl.java:99) [arquillian-core.jar:]
      	at org.jboss.arquillian.core.impl.EventContextImpl.proceed(EventContextImpl.java:81) [arquillian-core.jar:]
      	at org.jboss.arquillian.core.impl.ManagerImpl.fire(ManagerImpl.java:135) [arquillian-core.jar:]
      	at org.jboss.arquillian.core.impl.ManagerImpl.fire(ManagerImpl.java:115) [arquillian-core.jar:]
      	at org.jboss.arquillian.core.impl.EventImpl.fire(EventImpl.java:67) [arquillian-core.jar:]
      	at org.jboss.arquillian.container.test.impl.execution.ContainerTestExecuter.execute(ContainerTestExecuter.java:38) [arquillian-core.jar:]
      	at sun.reflect.NativeMethodAccessorImpl.invoke0(Native Method) [rt.jar:1.7.0_51]
      	at sun.reflect.NativeMethodAccessorImpl.invoke(NativeMethodAccessorImpl.java:57) [rt.jar:1.7.0_51]
      	at sun.reflect.DelegatingMethodAccessorImpl.invoke(DelegatingMethodAccessorImpl.java:43) [rt.jar:1.7.0_51]
      	at java.lang.reflect.Method.invoke(Method.java:606) [rt.jar:1.7.0_51]
      	at org.jboss.arquillian.core.impl.ObserverImpl.invoke(ObserverImpl.java:94) [arquillian-core.jar:]
      	at org.jboss.arquillian.core.impl.EventContextImpl.invokeObservers(EventContextImpl.java:99) [arquillian-core.jar:]
      	at org.jboss.arquillian.core.impl.EventContextImpl.proceed(EventContextImpl.java:81) [arquillian-core.jar:]
      	at org.jboss.arquillian.test.impl.TestContextHandler.createTestContext(TestContextHandler.java:89) [arquillian-core.jar:]
      	at sun.reflect.NativeMethodAccessorImpl.invoke0(Native Method) [rt.jar:1.7.0_51]
      	at sun.reflect.NativeMethodAccessorImpl.invoke(NativeMethodAccessorImpl.java:57) [rt.jar:1.7.0_51]
      	at sun.reflect.DelegatingMethodAccessorImpl.invoke(DelegatingMethodAccessorImpl.java:43) [rt.jar:1.7.0_51]
      	at java.lang.reflect.Method.invoke(Method.java:606) [rt.jar:1.7.0_51]
      	at org.jboss.arquillian.core.impl.ObserverImpl.invoke(ObserverImpl.java:94) [arquillian-core.jar:]
      	at org.jboss.arquillian.core.impl.EventContextImpl.proceed(EventContextImpl.java:88) [arquillian-core.jar:]
      	at org.jboss.arquillian.test.impl.TestContextHandler.createClassContext(TestContextHandler.java:75) [arquillian-core.jar:]
      	at sun.reflect.NativeMethodAccessorImpl.invoke0(Native Method) [rt.jar:1.7.0_51]
      	at sun.reflect.NativeMethodAccessorImpl.invoke(NativeMethodAccessorImpl.java:57) [rt.jar:1.7.0_51]
      	at sun.reflect.DelegatingMethodAccessorImpl.invoke(DelegatingMethodAccessorImpl.java:43) [rt.jar:1.7.0_51]
      	at java.lang.reflect.Method.invoke(Method.java:606) [rt.jar:1.7.0_51]
      	at org.jboss.arquillian.core.impl.ObserverImpl.invoke(ObserverImpl.java:94) [arquillian-core.jar:]
      	at org.jboss.arquillian.core.impl.EventContextImpl.proceed(EventContextImpl.java:88) [arquillian-core.jar:]
      	at org.jboss.arquillian.test.impl.TestContextHandler.createSuiteContext(TestContextHandler.java:60) [arquillian-core.jar:]
      	at sun.reflect.NativeMethodAccessorImpl.invoke0(Native Method) [rt.jar:1.7.0_51]
      	at sun.reflect.NativeMethodAccessorImpl.invoke(NativeMethodAccessorImpl.java:57) [rt.jar:1.7.0_51]
      	at sun.reflect.DelegatingMethodAccessorImpl.invoke(DelegatingMethodAccessorImpl.java:43) [rt.jar:1.7.0_51]
      	at java.lang.reflect.Method.invoke(Method.java:606) [rt.jar:1.7.0_51]
      	at org.jboss.arquillian.core.impl.ObserverImpl.invoke(ObserverImpl.java:94) [arquillian-core.jar:]
      	at org.jboss.arquillian.core.impl.EventContextImpl.proceed(EventContextImpl.java:88) [arquillian-core.jar:]
      	at org.jboss.arquillian.core.impl.ManagerImpl.fire(ManagerImpl.java:135) [arquillian-core.jar:]
      	at org.jboss.arquillian.test.impl.EventTestRunnerAdaptor.test(EventTestRunnerAdaptor.java:111) [arquillian-core.jar:]
      	at org.jboss.arquillian.junit.Arquillian$6.evaluate(Arquillian.java:263) [arquillian-junit.jar:]
      	at org.jboss.arquillian.junit.Arquillian$4.evaluate(Arquillian.java:226) [arquillian-junit.jar:]
      	at org.jboss.arquillian.junit.Arquillian.multiExecute(Arquillian.java:314) [arquillian-junit.jar:]
      	at org.jboss.arquillian.junit.Arquillian.access$100(Arquillian.java:46) [arquillian-junit.jar:]
      	at org.jboss.arquillian.junit.Arquillian$5.evaluate(Arquillian.java:240) [arquillian-junit.jar:]
      	at org.junit.runners.ParentRunner.runLeaf(ParentRunner.java:271) [arquillian-junit.jar:]
      	at org.junit.runners.BlockJUnit4ClassRunner.runChild(BlockJUnit4ClassRunner.java:70) [arquillian-junit.jar:]
      	at org.junit.runners.BlockJUnit4ClassRunner.runChild(BlockJUnit4ClassRunner.java:50) [arquillian-junit.jar:]
      	at org.junit.runners.ParentRunner$3.run(ParentRunner.java:238) [arquillian-junit.jar:]
      	at org.junit.runners.ParentRunner$1.schedule(ParentRunner.java:63) [arquillian-junit.jar:]
      	at org.junit.runners.ParentRunner.runChildren(ParentRunner.java:236) [arquillian-junit.jar:]
      	at org.junit.runners.ParentRunner.access$000(ParentRunner.java:53) [arquillian-junit.jar:]
      	at org.junit.runners.ParentRunner$2.evaluate(ParentRunner.java:229) [arquillian-junit.jar:]
      	at org.jboss.arquillian.junit.Arquillian$2.evaluate(Arquillian.java:185) [arquillian-junit.jar:]
      	at org.jboss.arquillian.junit.Arquillian.multiExecute(Arquillian.java:314) [arquillian-junit.jar:]
      	at org.jboss.arquillian.junit.Arquillian.access$100(Arquillian.java:46) [arquillian-junit.jar:]
      	at org.jboss.arquillian.junit.Arquillian$3.evaluate(Arquillian.java:199) [arquillian-junit.jar:]
      	at org.junit.runners.ParentRunner.run(ParentRunner.java:309) [arquillian-junit.jar:]
      	at org.jboss.arquillian.junit.Arquillian.run(Arquillian.java:147) [arquillian-junit.jar:]
      	at org.junit.runner.JUnitCore.run(JUnitCore.java:160) [arquillian-junit.jar:]
      	at org.junit.runner.JUnitCore.run(JUnitCore.java:138) [arquillian-junit.jar:]
      	at org.jboss.arquillian.junit.container.JUnitTestRunner.execute(JUnitTestRunner.java:65) [arquillian-junit.jar:]
      	at org.jboss.arquillian.protocol.servlet.runner.ServletTestRunner.executeTest(ServletTestRunner.java:160) [arquillian-protocol.jar:]
      	at org.jboss.arquillian.protocol.servlet.runner.ServletTestRunner.execute(ServletTestRunner.java:126) [arquillian-protocol.jar:]
      	at org.jboss.arquillian.protocol.servlet.runner.ServletTestRunner.doGet(ServletTestRunner.java:90) [arquillian-protocol.jar:]
      	at javax.servlet.http.HttpServlet.service(HttpServlet.java:687) [jboss-servlet-api_3.1_spec-1.0.0.Final.jar:1.0.0.Final]
      	at javax.servlet.http.HttpServlet.service(HttpServlet.java:790) [jboss-servlet-api_3.1_spec-1.0.0.Final.jar:1.0.0.Final]
      	at io.undertow.servlet.handlers.ServletHandler.handleRequest(ServletHandler.java:85) [undertow-servlet-1.0.0.CR1.jar:1.0.0.CR1]
      	at io.undertow.servlet.handlers.security.ServletSecurityRoleHandler.handleRequest(ServletSecurityRoleHandler.java:61) [undertow-servlet-1.0.0.CR1.jar:1.0.0.CR1]
      	at io.undertow.servlet.handlers.ServletDispatchingHandler.handleRequest(ServletDispatchingHandler.java:36) [undertow-servlet-1.0.0.CR1.jar:1.0.0.CR1]
      	at org.wildfly.extension.undertow.security.SecurityContextAssociationHandler.handleRequest(SecurityContextAssociationHandler.java:72)
      	at io.undertow.server.handlers.PredicateHandler.handleRequest(PredicateHandler.java:25) [undertow-core-1.0.0.CR1.jar:1.0.0.CR1]
      	at io.undertow.servlet.handlers.security.SSLInformationAssociationHandler.handleRequest(SSLInformationAssociationHandler.java:113) [undertow-servlet-1.0.0.CR1.jar:1.0.0.CR1]
      	at io.undertow.security.handlers.AuthenticationCallHandler.handleRequest(AuthenticationCallHandler.java:52) [undertow-core-1.0.0.CR1.jar:1.0.0.CR1]
      	at io.undertow.security.handlers.AbstractConfidentialityHandler.handleRequest(AbstractConfidentialityHandler.java:45) [undertow-core-1.0.0.CR1.jar:1.0.0.CR1]
      	at io.undertow.servlet.handlers.security.ServletConfidentialityConstraintHandler.handleRequest(ServletConfidentialityConstraintHandler.java:61) [undertow-servlet-1.0.0.CR1.jar:1.0.0.CR1]
      	at io.undertow.servlet.handlers.security.CachedAuthenticatedSessionHandler.handleRequest(CachedAuthenticatedSessionHandler.java:70) [undertow-servlet-1.0.0.CR1.jar:1.0.0.CR1]
      	at io.undertow.security.handlers.SecurityInitialHandler.handleRequest(SecurityInitialHandler.java:76) [undertow-core-1.0.0.CR1.jar:1.0.0.CR1]
      	at io.undertow.server.handlers.PredicateHandler.handleRequest(PredicateHandler.java:25) [undertow-core-1.0.0.CR1.jar:1.0.0.CR1]
      	at org.wildfly.extension.undertow.security.jacc.JACCContextIdHandler.handleRequest(JACCContextIdHandler.java:61)
      	at io.undertow.server.handlers.PredicateHandler.handleRequest(PredicateHandler.java:25) [undertow-core-1.0.0.CR1.jar:1.0.0.CR1]
      	at io.undertow.server.handlers.PredicateHandler.handleRequest(PredicateHandler.java:25) [undertow-core-1.0.0.CR1.jar:1.0.0.CR1]
      	at io.undertow.servlet.handlers.SessionRestoringHandler.handleRequest(SessionRestoringHandler.java:101) [undertow-servlet-1.0.0.CR1.jar:1.0.0.CR1]
      	at io.undertow.servlet.handlers.ServletInitialHandler.handleFirstRequest(ServletInitialHandler.java:240) [undertow-servlet-1.0.0.CR1.jar:1.0.0.CR1]
      	at io.undertow.servlet.handlers.ServletInitialHandler.dispatchRequest(ServletInitialHandler.java:227) [undertow-servlet-1.0.0.CR1.jar:1.0.0.CR1]
      	at io.undertow.servlet.handlers.ServletInitialHandler.access$000(ServletInitialHandler.java:73) [undertow-servlet-1.0.0.CR1.jar:1.0.0.CR1]
      	at io.undertow.servlet.handlers.ServletInitialHandler$1.handleRequest(ServletInitialHandler.java:146) [undertow-servlet-1.0.0.CR1.jar:1.0.0.CR1]
      	at io.undertow.server.Connectors.executeRootHandler(Connectors.java:168) [undertow-core-1.0.0.CR1.jar:1.0.0.CR1]
      	at io.undertow.server.HttpServerExchange$1.run(HttpServerExchange.java:687) [undertow-core-1.0.0.CR1.jar:1.0.0.CR1]
      	at java.util.concurrent.ThreadPoolExecutor.runWorker(ThreadPoolExecutor.java:1145) [rt.jar:1.7.0_51]
      	at java.util.concurrent.ThreadPoolExecutor$Worker.run(ThreadPoolExecutor.java:615) [rt.jar:1.7.0_51]
      	at java.lang.Thread.run(Thread.java:744) [rt.jar:1.7.0_51]
      Caused by: java.net.ConnectException: JBAS012144: Could not connect to remote://localhost:9999. The connection timed out
      	at org.jboss.as.protocol.ProtocolConnectionUtils.connectSync(ProtocolConnectionUtils.java:120)
      	at org.jboss.as.protocol.ProtocolConnectionManager$EstablishingConnection.connect(ProtocolConnectionManager.java:256)
      	at org.jboss.as.protocol.ProtocolConnectionManager.connect(ProtocolConnectionManager.java:70)
      	at org.jboss.as.protocol.mgmt.FutureManagementChannel$Establishing.getChannel(FutureManagementChannel.java:204)
      	at org.jboss.as.controller.client.impl.RemotingModelControllerClient.getOrCreateChannel(RemotingModelControllerClient.java:148) [wildfly-controller-client-8.0.0.Final-SNAPSHOT.jar:8.0.0.Final-SNAPSHOT]
      	at org.jboss.as.controller.client.impl.RemotingModelControllerClient$1.getChannel(RemotingModelControllerClient.java:67) [wildfly-controller-client-8.0.0.Final-SNAPSHOT.jar:8.0.0.Final-SNAPSHOT]
      	at org.jboss.as.protocol.mgmt.ManagementChannelHandler.executeRequest(ManagementChannelHandler.java:117)
      	at org.jboss.as.protocol.mgmt.ManagementChannelHandler.executeRequest(ManagementChannelHandler.java:92)
      	at org.jboss.as.controller.client.impl.AbstractModelControllerClient.executeRequest(AbstractModelControllerClient.java:236) [wildfly-controller-client-8.0.0.Final-SNAPSHOT.jar:8.0.0.Final-SNAPSHOT]
      	at org.jboss.as.controller.client.impl.AbstractModelControllerClient.execute(AbstractModelControllerClient.java:141) [wildfly-controller-client-8.0.0.Final-SNAPSHOT.jar:8.0.0.Final-SNAPSHOT]
      	at org.jboss.as.controller.client.impl.AbstractModelControllerClient.executeForResult(AbstractModelControllerClient.java:127) [wildfly-controller-client-8.0.0.Final-SNAPSHOT.jar:8.0.0.Final-SNAPSHOT]
      	... 106 more
      
      18:31:38,205 INFO  [org.wildfly.extension.undertow] (MSC service thread 1-1) JBAS017535: Unregister web context: /test
      18:31:38,455 INFO  [org.hibernate.validator.internal.util.Version] (MSC service thread 1-1) HV000001: Hibernate Validator 5.0.3.Final
      18:31:38,573 INFO  [org.jboss.as.server.deployment] (MSC service thread 1-1) JBAS015877: Stopped deployment test.war (runtime-name: test.war) in 376ms
      18:31:38,590 INFO  [org.jboss.as.repository] (management-handler-thread - 1) JBAS014901: Content removed from location C:\hudson\workspace\narayana-windows2008-taconic\blacktie\wildfly-8.0.0.Final-SNAPSHOT\standalone\data\content\22\88761be679276672f72e33848acde196874007\content
      18:31:38,591 INFO  [org.jboss.as.server] (management-handler-thread - 1) JBAS018558: Undeployed "test.war" (runtime-name: "test.war")
      Tests run: 1, Failures: 1, Errors: 0, Skipped: 0, Time elapsed: 38.665 sec <<< FAILURE!
      testAdvertiseUnadvertise(AdvertiseUnadvertiseTest)  Time elapsed: 29.966 sec  <<< FAILURE!
      java.lang.AssertionError: null
      	at org.junit.Assert.fail(Assert.java:86)
      	at org.junit.Assert.assertTrue(Assert.java:41)
      	at org.junit.Assert.assertTrue(Assert.java:52)
      	at AdvertiseUnadvertiseTest.testAdvertiseUnadvertise(AdvertiseUnadvertiseTest.java:63)
      
      
      Results :
      
      Failed tests: 
        AdvertiseUnadvertiseTest.testAdvertiseUnadvertise:63 null
      
      Tests run: 1, Failures: 1, Errors: 0, Skipped: 0
      

        Gliffy Diagrams

          Attachments

            Issue Links

              Activity

                People

                • Assignee:
                  zhfeng Zheng Feng
                  Reporter:
                  gytis Gytis Trikleris
                • Votes:
                  0 Vote for this issue
                  Watchers:
                  1 Start watching this issue

                  Dates

                  • Created:
                    Updated:
                    Resolved: