Uploaded image for project: 'JBoss Transaction Manager'
  1. JBoss Transaction Manager
  2. JBTM-1127

tx-object-store not empty after running TestATSubordinateCrashDuringPrepare XTS recovery test

    Details

    • Type: Bug
    • Status: Closed (View Workflow)
    • Priority: Major
    • Resolution: Done
    • Affects Version/s: 4.16.3, 4.17.0.M1/5.0.0.M1
    • Fix Version/s: 4.16.4, 4.17.0
    • Component/s: Testing, XTS
    • Labels:
      None

      Description

      The following assertion fails when the test completes with transaction logs stil present in the tx-object-store.

      -------------------------------------------------------------------------------
      Test set: com.arjuna.qa.junit.TestATSubordinateCrashDuringPrepare
      -------------------------------------------------------------------------------
      Tests run: 1, Failures: 1, Errors: 0, Skipped: 0, Time elapsed: 79.706 sec <<< FAILURE!
      subordinateMultiParticipantPrepareAndCommitTest(com.arjuna.qa.junit.TestATSubordinateCrashDuringPrepare)  Time elapsed: 79.694 sec  <<< FAILURE!
      java.lang.AssertionError
      	at org.junit.Assert.fail(Assert.java:92)
      	at org.junit.Assert.assertTrue(Assert.java:43)
      	at org.junit.Assert.assertTrue(Assert.java:54)
      	at com.arjuna.qa.junit.BaseCrashTest.tearDown(BaseCrashTest.java:94)
      

      See:
      http://172.17.131.2/view/XTS%20recovery/job/narayana-xts-recovery-java6/28/

        Gliffy Diagrams

          Attachments

            Activity

              People

              • Assignee:
                paul.robinson Paul Robinson
                Reporter:
                paul.robinson Paul Robinson
              • Votes:
                0 Vote for this issue
                Watchers:
                0 Start watching this issue

                Dates

                • Created:
                  Updated:
                  Resolved: