Uploaded image for project: 'Tools (JBoss Tools)'
  1. Tools (JBoss Tools)
  2. JBIDE-19354

Fix failing tests in OpenShift

    XMLWordPrintable

    Details

    • Type: Bug
    • Status: Closed (View Workflow)
    • Priority: Blocker
    • Resolution: Done
    • Affects Version/s: 4.3.0.Alpha2
    • Fix Version/s: 4.3.0.Alpha2
    • Component/s: openshift
    • Labels:
      None

      Description

      There are plenty of filing tests in OpenShift master (4.2.0.Alpha2) currently. We need to fix those asap.

      -------------------------------------------------------
       T E S T S
      -------------------------------------------------------
      Running org.jboss.tools.openshift.express.test.AllTestsSuite
      Tests run: 62, Failures: 0, Errors: 0, Skipped: 0, Time elapsed: 5.639 sec - in org.jboss.tools.openshift.express.test.AllTestsSuite
      testGetAdapterList(org.jboss.tools.openshift.express.test.ui.ActionFilterAdapterFactoryTest)  Time elapsed: 0.009 sec
      testGetAdapterListForIApplication(org.jboss.tools.openshift.express.test.ui.ActionFilterAdapterFactoryTest)  Time elapsed: 0 sec
      shouldOnlySupportIActionFilterAdapters(org.jboss.tools.openshift.express.test.ui.ActionFilterAdapterFactoryTest)  Time elapsed: 0.001 sec
      testGetElements(org.jboss.tools.openshift.express.test.ui.wizard.application.details.ApplicationDetailsContentProviderTest)  Time elapsed: 0.047 sec
      testGetPropertyDescriptors(org.jboss.tools.openshift.express.test.ui.property.ApplicationPropertySourceTest)  Time elapsed: 0.001 sec
      testGetPropertyValueForScalable(org.jboss.tools.openshift.express.test.ui.property.ApplicationPropertySourceTest)  Time elapsed: 0 sec
      addedOpenShiftProfileHasWebappsOutputDirectory(org.jboss.tools.openshift.express.test.ui.wizard.application.importoperation.OpenShiftMavenProfileTests)  Time elapsed: 0.582 sec
      addedOpenShiftProfileIsCorrect(org.jboss.tools.openshift.express.test.ui.wizard.application.importoperation.OpenShiftMavenProfileTests)  Time elapsed: 0.157 sec
      canAddOpenShiftProfileToComplexPom(org.jboss.tools.openshift.express.test.ui.wizard.application.importoperation.OpenShiftMavenProfileTests)  Time elapsed: 0.295 sec
      addedOpenShiftProfileHasDeploymentsOutputDirectory(org.jboss.tools.openshift.express.test.ui.wizard.application.importoperation.OpenShiftMavenProfileTests)  Time elapsed: 0.276 sec
      doesNotAddOpenShiftProfileIfAlreadyPresent(org.jboss.tools.openshift.express.test.ui.wizard.application.importoperation.OpenShiftMavenProfileTests)  Time elapsed: 0.862 sec
      canDetectOpenShiftProfilePresent(org.jboss.tools.openshift.express.test.ui.wizard.application.importoperation.OpenShiftMavenProfileTests)  Time elapsed: 0.21 sec
      canDetectOpenShiftProfileInComplexPom(org.jboss.tools.openshift.express.test.ui.wizard.application.importoperation.OpenShiftMavenProfileTests)  Time elapsed: 0.215 sec
      canAddOpenShiftProfile(org.jboss.tools.openshift.express.test.ui.wizard.application.importoperation.OpenShiftMavenProfileTests)  Time elapsed: 0.215 sec
      canDetectOpenShiftProfileNotPresent(org.jboss.tools.openshift.express.test.ui.wizard.application.importoperation.OpenShiftMavenProfileTests)  Time elapsed: 0.206 sec
      pomHasOpenShiftProfileAfterAdd(org.jboss.tools.openshift.express.test.ui.wizard.application.importoperation.OpenShiftMavenProfileTests)  Time elapsed: 0.211 sec
      doesNotAddMavenWarPluginIfNullOutputFolder(org.jboss.tools.openshift.express.test.ui.wizard.application.importoperation.OpenShiftMavenProfileTests)  Time elapsed: 0.198 sec
      canDetectPomInProject(org.jboss.tools.openshift.express.test.ui.wizard.application.importoperation.OpenShiftMavenProfileTests)  Time elapsed: 0.207 sec
      shouldNotAddJenkinsApplication(org.jboss.tools.openshift.express.test.core.EmbedCartridgeStrategyTest)  Time elapsed: 0.029 sec
      shouldRemoveRockmongoAnd10genAndMongoDb(org.jboss.tools.openshift.express.test.core.EmbedCartridgeStrategyTest)  Time elapsed: 0 sec
      shouldRemovePhpMyAdmin(org.jboss.tools.openshift.express.test.core.EmbedCartridgeStrategyTest)  Time elapsed: 0 sec
      shouldNotAddMySql(org.jboss.tools.openshift.express.test.core.EmbedCartridgeStrategyTest)  Time elapsed: 0.001 sec
      shouldRemovePhpMyAdminAndMySql(org.jboss.tools.openshift.express.test.core.EmbedCartridgeStrategyTest)  Time elapsed: 0 sec
      shouldAddPhpMyAdminAndMySql(org.jboss.tools.openshift.express.test.core.EmbedCartridgeStrategyTest)  Time elapsed: 0 sec
      shouldAddJenkinsApplication(org.jboss.tools.openshift.express.test.core.EmbedCartridgeStrategyTest)  Time elapsed: 0.001 sec
      shouldAddRockmongoAndMongoDb(org.jboss.tools.openshift.express.test.core.EmbedCartridgeStrategyTest)  Time elapsed: 0 sec
      shouldAddMySql(org.jboss.tools.openshift.express.test.core.EmbedCartridgeStrategyTest)  Time elapsed: 0 sec
      testRegistryHasChildren(org.jboss.tools.openshift.express.test.ui.explorer.ExpressExplorerContentProviderTest)  Time elapsed: 0.04 sec
      testConnectionHasChildren(org.jboss.tools.openshift.express.test.ui.explorer.ExpressExplorerContentProviderTest)  Time elapsed: 0.001 sec
      getExplorerElementsReturnsDomainsForExpressConnections(org.jboss.tools.openshift.express.test.ui.explorer.ExpressExplorerContentProviderTest)  Time elapsed: 0.103 sec
      getElementsReturnsExpressConnectionsForTheRegistry(org.jboss.tools.openshift.express.test.ui.explorer.ExpressExplorerContentProviderTest)  Time elapsed: 0 sec
      testDomainHasChildren(org.jboss.tools.openshift.express.test.ui.explorer.ExpressExplorerContentProviderTest)  Time elapsed: 0 sec
      testApplicationHasChildren(org.jboss.tools.openshift.express.test.ui.explorer.ExpressExplorerContentProviderTest)  Time elapsed: 0.001 sec
      testConstructionOfPrompterThrowsWhenInitializedWithSelf(org.jboss.tools.openshift.express.test.core.LazyCredentialsPrompterTest)  Time elapsed: 0.003 sec
      testPromptAndAuthenticateWhenInitializedWithAPrompter(org.jboss.tools.openshift.express.test.core.LazyCredentialsPrompterTest)  Time elapsed: 0.005 sec
      testPromptAndAuthenticateReturnsFalseWhenItCantGetAPrompter(org.jboss.tools.openshift.express.test.core.LazyCredentialsPrompterTest)  Time elapsed: 0 sec
      testPromptAndAuthenticateDeferredLoadsAndPromptsWhenInitializedWithNull(org.jboss.tools.openshift.express.test.core.LazyCredentialsPrompterTest)  Time elapsed: 0 sec
      testAllowCertificateDeferredLoadsWhenInitializedWithNull(org.jboss.tools.openshift.express.test.core.LazySSLCertificateCallbackTest)  Time elapsed: 0.002 sec
      testAllowHostnameWhenInitializedWithACallback(org.jboss.tools.openshift.express.test.core.LazySSLCertificateCallbackTest)  Time elapsed: 0 sec
      testAllowHostnameDeferredLoadsWhenInitializedWithNull(org.jboss.tools.openshift.express.test.core.LazySSLCertificateCallbackTest)  Time elapsed: 0 sec
      testConstructionThrowsWhenInitializedWithSelf(org.jboss.tools.openshift.express.test.core.LazySSLCertificateCallbackTest)  Time elapsed: 0.001 sec
      testHostnameReturnsFalseWhenItCantGetACallback(org.jboss.tools.openshift.express.test.core.LazySSLCertificateCallbackTest)  Time elapsed: 0.001 sec
      testAllowCertificateReturnsFalseWhenItCantGetACallback(org.jboss.tools.openshift.express.test.core.LazySSLCertificateCallbackTest)  Time elapsed: 0.001 sec
      testAllowCertificateWhenInitializedWithACallback(org.jboss.tools.openshift.express.test.core.LazySSLCertificateCallbackTest)  Time elapsed: 0.001 sec
      shouldDetectIdentityFile(org.jboss.tools.openshift.express.test.ui.utils.SSHUserConfigTest)  Time elapsed: 0.007 sec
      shouldNotDetectIdentityFile(org.jboss.tools.openshift.express.test.ui.utils.SSHUserConfigTest)  Time elapsed: 0 sec
      shouldIgnoreDotFileInMarkers(org.jboss.tools.openshift.express.test.core.OpenShiftMarkerTest)  Time elapsed: 0.228 sec
      shouldReturnAllKnownMarkersAnd1Custom(org.jboss.tools.openshift.express.test.core.OpenShiftMarkerTest)  Time elapsed: 0.058 sec
      shouldReturnAllKnownMarkersAnd1Present(org.jboss.tools.openshift.express.test.core.OpenShiftMarkerTest)  Time elapsed: 0.065 sec
      shouldReturnAllKnownMarkersAndNonePresent(org.jboss.tools.openshift.express.test.core.OpenShiftMarkerTest)  Time elapsed: 0.088 sec
      shouldRemoveMarker(org.jboss.tools.openshift.express.test.core.OpenShiftMarkerTest)  Time elapsed: 0.33 sec
      shouldCreateMarkerWhenMissingMarkersFolder(org.jboss.tools.openshift.express.test.core.OpenShiftMarkerTest)  Time elapsed: 0.041 sec
      nullTargetShouldReturnFalse(org.jboss.tools.openshift.express.test.ui.filters.SimplePropertyActionFilterTest)  Time elapsed: 0 sec
      targetWithoutPropertyShouldReturnFalse(org.jboss.tools.openshift.express.test.ui.filters.SimplePropertyActionFilterTest)  Time elapsed: 0.014 sec
      targetWithMachingEnumPropertyShouldReturnTrue(org.jboss.tools.openshift.express.test.ui.filters.SimplePropertyActionFilterTest)  Time elapsed: 0 sec
      targetWithNonMatchingStringPropertyShouldReturnFalse(org.jboss.tools.openshift.express.test.ui.filters.SimplePropertyActionFilterTest)  Time elapsed: 0 sec
      targetWithMatchingStringPropertyShouldReturnTrue(org.jboss.tools.openshift.express.test.ui.filters.SimplePropertyActionFilterTest)  Time elapsed: 0 sec
      shouldAdd1Value(org.jboss.tools.openshift.express.test.core.StringsPreferenceValueTest)  Time elapsed: 0.001 sec
      shouldDropFirstValueWhenMaximumReached(org.jboss.tools.openshift.express.test.core.StringsPreferenceValueTest)  Time elapsed: 0.002 sec
      shouldAdd3Values(org.jboss.tools.openshift.express.test.core.StringsPreferenceValueTest)  Time elapsed: 0.002 sec
      shouldRemove1Value(org.jboss.tools.openshift.express.test.core.StringsPreferenceValueTest)  Time elapsed: 0.001 sec
      shouldRemove2Values(org.jboss.tools.openshift.express.test.core.StringsPreferenceValueTest)  Time elapsed: 0.001 sec
      
      Results :
      
      Tests run: 62, Failures: 0, Errors: 0, Skipped: 0
      
      [INFO] All tests passed!
      [INFO] 
      [INFO] --- repository-utils:0.22.1-SNAPSHOT:compare-version-with-baselines (default) @ org.jboss.tools.openshift.express.test ---
      [INFO]                                                                         
      [INFO] ------------------------------------------------------------------------
      [INFO] Building org.jboss.tools.openshift.test 3.0.0-SNAPSHOT
      [INFO] ------------------------------------------------------------------------
      [INFO] 
      [INFO] --- tycho-packaging-plugin:0.22.0:build-qualifier (default-build-qualifier) @ org.jboss.tools.openshift.test ---
      [INFO] The project's OSGi version is 3.0.0.Alpha2-v20150223-1950-B713
      [INFO] 
      [INFO] --- tycho-packaging-plugin:0.22.0:validate-id (default-validate-id) @ org.jboss.tools.openshift.test ---
      [INFO] 
      [INFO] --- tycho-packaging-plugin:0.22.0:validate-version (default-validate-version) @ org.jboss.tools.openshift.test ---
      [INFO] 
      [INFO] --- jacoco-maven-plugin:0.7.1.201405082137:prepare-agent (default) @ org.jboss.tools.openshift.test ---
      [INFO] tycho.testArgLine set to -javaagent:/mnt/hudson_workspace/workspace/jbosstools-openshift_master/.repository/org/jacoco/org.jacoco.agent/0.7.1.201405082137/org.jacoco.agent-0.7.1.201405082137-runtime.jar=destfile=/mnt/hudson_workspace/workspace/jbosstools-openshift_master/sources/target/jacoco.exec,append=true,includes=org.jboss.tools.*
      [INFO] 
      [INFO] --- maven-resources-plugin:2.4.1:resources (default-resources) @ org.jboss.tools.openshift.test ---
      [INFO] Using 'ISO-8859-1' encoding to copy filtered resources.
      [INFO] skip non existing resourceDirectory /mnt/hudson_workspace/workspace/jbosstools-openshift_master/sources/tests/org.jboss.tools.openshift.test/src/main/resources
      [INFO] 
      [INFO] --- tycho-compiler-plugin:0.22.0:compile (default-compile) @ org.jboss.tools.openshift.test ---
      [INFO] Nothing to compile - all classes are up to date
      [INFO] 
      [INFO] --- maven-resources-plugin:2.4.1:testResources (default-testResources) @ org.jboss.tools.openshift.test ---
      [INFO] Using 'ISO-8859-1' encoding to copy filtered resources.
      [INFO] skip non existing resourceDirectory /mnt/hudson_workspace/workspace/jbosstools-openshift_master/sources/tests/org.jboss.tools.openshift.test/src/test/resources
      [INFO] 
      [INFO] --- tycho-source-plugin:0.22.0:plugin-source (plugin-source) @ org.jboss.tools.openshift.test ---
      [INFO] Building jar: /mnt/hudson_workspace/workspace/jbosstools-openshift_master/sources/tests/org.jboss.tools.openshift.test/target/org.jboss.tools.openshift.test-3.0.0-SNAPSHOT-sources.jar
      [INFO] 
      [INFO] --- target-platform-configuration:0.22.0:target-platform (default-target-platform) @ org.jboss.tools.openshift.test ---
      [INFO] 
      [INFO] --- tycho-packaging-plugin:0.22.0:package-plugin (default-package-plugin) @ org.jboss.tools.openshift.test ---
      [INFO] Building jar: /mnt/hudson_workspace/workspace/jbosstools-openshift_master/sources/tests/org.jboss.tools.openshift.test/target/org.jboss.tools.openshift.test-3.0.0-SNAPSHOT.jar
      [INFO] 
      [INFO] --- tycho-p2-plugin:0.22.0:p2-metadata-default (default-p2-metadata-default) @ org.jboss.tools.openshift.test ---
      [INFO] 
      [INFO] --- repository-utils:0.22.1-SNAPSHOT:generate-repository-facade (generate-facade) @ org.jboss.tools.openshift.test ---
      [INFO] 
      [INFO] --- tycho-pack200a-plugin:0.22.0:normalize (pack200-normalize) @ org.jboss.tools.openshift.test ---
      [INFO] Pack200 normalizing jar /mnt/hudson_workspace/workspace/jbosstools-openshift_master/sources/tests/org.jboss.tools.openshift.test/target/org.jboss.tools.openshift.test-3.0.0-SNAPSHOT.jar
      [INFO] 
      [INFO] --- exec-maven-plugin:1.2.1:exec (jarsign) @ org.jboss.tools.openshift.test ---
      [INFO] skipping execute as per configuraion
      [INFO] 
      [INFO] --- tycho-pack200b-plugin:0.22.0:pack (pack200-pack) @ org.jboss.tools.openshift.test ---
      [INFO] Pack200 packing jar /mnt/hudson_workspace/workspace/jbosstools-openshift_master/sources/tests/org.jboss.tools.openshift.test/target/org.jboss.tools.openshift.test-3.0.0-SNAPSHOT.jar
      [INFO] 
      [INFO] --- tycho-p2-plugin:0.22.0:p2-metadata (attached-p2-metadata) @ org.jboss.tools.openshift.test ---
      [INFO] 
      [INFO] --- tycho-p2-plugin:0.22.0:p2-metadata (p2-metadata) @ org.jboss.tools.openshift.test ---
      [INFO] 
      [INFO] --- tycho-surefire-plugin:0.22.0:test (default-test) @ org.jboss.tools.openshift.test ---
      [INFO] Expected eclipse log file: /mnt/hudson_workspace/workspace/jbosstools-openshift_master/sources/tests/org.jboss.tools.openshift.test/target/work/data/.metadata/.log
      [INFO] Command line:
      	[/qa/tools/opt/x86_64/jdk1.7.0_67/jre/bin/java, -Dosgi.noShutdown=false, -Dosgi.os=linux, -Dosgi.ws=gtk, -Dosgi.arch=x86_64, -javaagent:/mnt/hudson_workspace/workspace/jbosstools-openshift_master/.repository/org/jacoco/org.jacoco.agent/0.7.1.201405082137/org.jacoco.agent-0.7.1.201405082137-runtime.jar=destfile=/mnt/hudson_workspace/workspace/jbosstools-openshift_master/sources/target/jacoco.exec,append=true,includes=org.jboss.tools.*, -Xms512m, -Xmx1024m, -XX:PermSize=256m, -XX:MaxPermSize=256m, -Dusage_reporting_enabled=false, -Dorg.jboss.tools.tests.skipPrivateRequirements=false, -Dorg.eclipse.ui.testsDisableWorkbenchAutoSave=true, -Dosgi.clean=true, -jar, /mnt/hudson_workspace/workspace/jbosstools-openshift_master/.repository/p2/osgi/bundle/org.eclipse.equinox.launcher/1.3.0.v20140415-2008/org.eclipse.equinox.launcher-1.3.0.v20140415-2008.jar, -data, /mnt/hudson_workspace/workspace/jbosstools-openshift_master/sources/tests/org.jboss.tools.openshift.test/target/work/data, -install, /mnt/hudson_workspace/workspace/jbosstools-openshift_master/sources/tests/org.jboss.tools.openshift.test/target/work, -configuration, /mnt/hudson_workspace/workspace/jbosstools-openshift_master/sources/tests/org.jboss.tools.openshift.test/target/work/configuration, -application, org.eclipse.tycho.surefire.osgibooter.uitest, -testproperties, /mnt/hudson_workspace/workspace/jbosstools-openshift_master/sources/tests/org.jboss.tools.openshift.test/target/surefire.properties]
      
      -------------------------------------------------------
       T E S T S
      -------------------------------------------------------
      Running org.jboss.tools.openshift.test.AllTestsSuite
      Tests run: 41, Failures: 1, Errors: 0, Skipped: 0, Time elapsed: 0.94 sec <<< FAILURE! - in org.jboss.tools.openshift.test.AllTestsSuite
      getCustomPropertyValues(org.jboss.tools.openshift.test.ui.property.BuildConfigPropertySourceTest)  Time elapsed: 0.041 sec
      getSTIPropertyValues(org.jboss.tools.openshift.test.ui.property.BuildConfigPropertySourceTest)  Time elapsed: 0.019 sec
      getPropertyDescriptorForCustomBuild(org.jboss.tools.openshift.test.ui.property.BuildConfigPropertySourceTest)  Time elapsed: 0.03 sec
      getGitSourcePropertyValues(org.jboss.tools.openshift.test.ui.property.BuildConfigPropertySourceTest)  Time elapsed: 0.012 sec
      getOutputPropertyValues(org.jboss.tools.openshift.test.ui.property.BuildConfigPropertySourceTest)  Time elapsed: 0.008 sec
      getPropertyDescriptorForSTIBuild(org.jboss.tools.openshift.test.ui.property.BuildConfigPropertySourceTest)  Time elapsed: 0.013 sec
      getPropertyDescriptorForGitBuildSource(org.jboss.tools.openshift.test.ui.property.BuildConfigPropertySourceTest)  Time elapsed: 0.012 sec
      getDockerPropertyValues(org.jboss.tools.openshift.test.ui.property.BuildConfigPropertySourceTest)  Time elapsed: 0.013 sec
      getPropertyDescriptorForDockerBuild(org.jboss.tools.openshift.test.ui.property.BuildConfigPropertySourceTest)  Time elapsed: 0.011 sec
      getPropertyValue(org.jboss.tools.openshift.test.ui.property.ConnectionPropertySourceTest)  Time elapsed: 0.053 sec
      getPropertyDescriptor(org.jboss.tools.openshift.test.ui.property.ConnectionPropertySourceTest)  Time elapsed: 0.002 sec  <<< FAILURE!
      java.lang.AssertionError: Exp. property descriptor: <null>,Host,Host
      	at org.junit.Assert.fail(Assert.java:88)
      	at org.junit.Assert.assertTrue(Assert.java:41)
      	at org.jboss.tools.openshift.test.ui.property.Assert.assertPropertyDescriptorsContains(Assert.java:31)
      	at org.jboss.tools.openshift.test.ui.property.Assert.assertPropertyDescriptorsEquals(Assert.java:38)
      	at org.jboss.tools.openshift.test.ui.property.ConnectionPropertySourceTest.getPropertyDescriptor(ConnectionPropertySourceTest.java:43)
      
      getForAConnectionTypeShouldReturnACollectionOfTheRightTypeTest(org.jboss.tools.openshift.test.core.connection.ConnectionRegistryTest)  Time elapsed: 0.01 sec
      testGetHost(org.jboss.tools.openshift.test.core.connection.ConnectionTest)  Time elapsed: 0 sec
      testGetScheme(org.jboss.tools.openshift.test.core.connection.ConnectionTest)  Time elapsed: 0.001 sec
      getResourceKindShouldCallClient(org.jboss.tools.openshift.test.core.connection.ConnectionTest)  Time elapsed: 0.01 sec
      testCategoryIsSet(org.jboss.tools.openshift.test.ui.property.ExtTextPropertyDescriptorTest)  Time elapsed: 0 sec
      testDisplayNameFromEnum(org.jboss.tools.openshift.test.ui.property.ExtTextPropertyDescriptorTest)  Time elapsed: 0 sec
      connectionsShouldHaveChildren(org.jboss.tools.openshift.test.ui.explorer.OpenShiftExplorerContentProviderTest)  Time elapsed: 0.002 sec
      getChildrenForConnectionReturnsProjects(org.jboss.tools.openshift.test.ui.explorer.OpenShiftExplorerContentProviderTest)  Time elapsed: 0.001 sec
      connectionsRegistryShouldHaveChildren(org.jboss.tools.openshift.test.ui.explorer.OpenShiftExplorerContentProviderTest)  Time elapsed: 0 sec
      projectsShouldHaveChildren(org.jboss.tools.openshift.test.ui.explorer.OpenShiftExplorerContentProviderTest)  Time elapsed: 0.001 sec
      getChildrenForProjectReturnsResourceGroups(org.jboss.tools.openshift.test.ui.explorer.OpenShiftExplorerContentProviderTest)  Time elapsed: 0.002 sec
      getChildrenForResourceGroupReturnsResources(org.jboss.tools.openshift.test.ui.explorer.OpenShiftExplorerContentProviderTest)  Time elapsed: 0.01 sec
      getExplorerElementsForRegistryReturnsConnections(org.jboss.tools.openshift.test.ui.explorer.OpenShiftExplorerContentProviderTest)  Time elapsed: 0 sec
      resourceGroupingsShouldHaveChildrenWhenTheyHaveNonEmptyList(org.jboss.tools.openshift.test.ui.explorer.OpenShiftExplorerContentProviderTest)  Time elapsed: 0.007 sec
      getStyledTextForResourceGrouping(org.jboss.tools.openshift.test.ui.explorer.OpenShiftExplorerLabelProviderTest)  Time elapsed: 0.015 sec
      getStyledTextForADeploymentConfig(org.jboss.tools.openshift.test.ui.explorer.OpenShiftExplorerLabelProviderTest)  Time elapsed: 0.01 sec
      getStyledTextForAService(org.jboss.tools.openshift.test.ui.explorer.OpenShiftExplorerLabelProviderTest)  Time elapsed: 0.007 sec
      getStyledTextForAPod(org.jboss.tools.openshift.test.ui.explorer.OpenShiftExplorerLabelProviderTest)  Time elapsed: 0.008 sec
      getStyledTextForAReplicationController(org.jboss.tools.openshift.test.ui.explorer.OpenShiftExplorerLabelProviderTest)  Time elapsed: 0.007 sec
      getStyledTextForAProject(org.jboss.tools.openshift.test.ui.explorer.OpenShiftExplorerLabelProviderTest)  Time elapsed: 0.005 sec
      getStyledTextForAConnection(org.jboss.tools.openshift.test.ui.explorer.OpenShiftExplorerLabelProviderTest)  Time elapsed: 0 sec
      getStyledTextForABuild(org.jboss.tools.openshift.test.ui.explorer.OpenShiftExplorerLabelProviderTest)  Time elapsed: 0.008 sec
      getStyledTextForABuildConfig(org.jboss.tools.openshift.test.ui.explorer.OpenShiftExplorerLabelProviderTest)  Time elapsed: 0.006 sec
      getStyledTextForAnImageRepository(org.jboss.tools.openshift.test.ui.explorer.OpenShiftExplorerLabelProviderTest)  Time elapsed: 0.008 sec
      getStyledTextForAPodWithoutLabels(org.jboss.tools.openshift.test.ui.explorer.OpenShiftExplorerLabelProviderTest)  Time elapsed: 0.005 sec
      getStyledTextForAProjectWithoutNamespace(org.jboss.tools.openshift.test.ui.explorer.OpenShiftExplorerLabelProviderTest)  Time elapsed: 0.005 sec
      getPropertyValue(org.jboss.tools.openshift.test.ui.property.ResourcePropertySourceTest)  Time elapsed: 0.003 sec
      getPropertyDescriptor(org.jboss.tools.openshift.test.ui.property.ResourcePropertySourceTest)  Time elapsed: 0.006 sec
      testSerialize(org.jboss.tools.openshift.test.common.core.util.StringUtilsTest)  Time elapsed: 0 sec
      testHumanize(org.jboss.tools.openshift.test.common.core.util.StringUtilsTest)  Time elapsed: 0 sec
      
      Results :
      
      Failed tests: 
        ConnectionPropertySourceTest.getPropertyDescriptor:43 Exp. property descriptor: <null>,Host,Host
      
      Tests run: 41, Failures: 1, Errors: 0, Skipped: 0
      

        Attachments

          Issue Links

            Activity

              People

              Assignee:
              adietish André Dietisheim
              Reporter:
              adietish André Dietisheim
              Votes:
              0 Vote for this issue
              Watchers:
              1 Start watching this issue

                Dates

                Created:
                Updated:
                Resolved: