-
Bug
-
Resolution: Not a Bug
-
Major
-
None
-
7.4.1.CR1
-
None
-
False
-
False
-
-
-
-
-
-
When running:
./integration-tests.sh install -Dts.iiop -Dtest=IIOPSslInvocationTestCase -Denforcer.skip=true
We get the following error:
[INFO] --- maven-surefire-plugin:2.22.2:test (tests-iiop-multi-node.surefire) @ wildfly-ts-integ-iiop ---
[INFO]
[INFO] -------------------------------------------------------
[INFO] T E S T S
[INFO] -------------------------------------------------------
[INFO] Running org.jboss.as.test.iiopssl.basic.IIOPSslInvocationTestCase
[ERROR] Tests run: 1, Failures: 0, Errors: 1, Skipped: 0, Time elapsed: 7.461 s <<< FAILURE! - in org.jboss.as.test.iiopssl.basic.IIOPSslInvocationTestCase
[ERROR] org.jboss.as.test.iiopssl.basic.IIOPSslInvocationTestCase Time elapsed: 7.458 s <<< ERROR!
org.jboss.arquillian.container.spi.client.container.DeploymentException:
Cannot deploy server.jar: {"WFLYCTL0062: Composite operation failed and was rolled back. Steps that failed:" => {"Operation step-1" => {"WFLYCTL0080: Failed services" => {"jboss.deployment.unit.\"server.jar\".component.IIOPSslStatelessBean.EjbIIOPService" => "org.omg.CORBA.COMM_FAILURE: vmcid: SUN minor code: 201 completed: No
Caused by: org.omg.CORBA.COMM_FAILURE: vmcid: SUN minor code: 201 completed: No
Caused by: java.net.ConnectException: Connection refused"}}}}
at org.jboss.as.arquillian.container.ArchiveDeployer.deployInternal(ArchiveDeployer.java:184)
at org.jboss.as.arquillian.container.ArchiveDeployer.deployInternal(ArchiveDeployer.java:162)
at org.jboss.as.arquillian.container.ArchiveDeployer.deploy(ArchiveDeployer.java:91)
at org.jboss.as.arquillian.container.CommonDeployableContainer.deploy(CommonDeployableContainer.java:255)
at org.jboss.arquillian.container.impl.client.container.ContainerDeployController$3.call(ContainerDeployController.java:151)
at org.jboss.arquillian.container.impl.client.container.ContainerDeployController$3.call(ContainerDeployController.java:118)
at org.jboss.arquillian.container.impl.client.container.ContainerDeployController.executeOperation(ContainerDeployController.java:239)
at org.jboss.arquillian.container.impl.client.container.ContainerDeployController.deploy(ContainerDeployController.java:118)
at java.base/jdk.internal.reflect.NativeMethodAccessorImpl.invoke0(Native Method)
at java.base/jdk.internal.reflect.NativeMethodAccessorImpl.invoke(NativeMethodAccessorImpl.java:62)
at java.base/jdk.internal.reflect.DelegatingMethodAccessorImpl.invoke(DelegatingMethodAccessorImpl.java:43)
at java.base/java.lang.reflect.Method.invoke(Method.java:566)
at org.jboss.arquillian.core.impl.ObserverImpl.invoke(ObserverImpl.java:86)
at org.jboss.arquillian.core.impl.EventContextImpl.invokeObservers(EventContextImpl.java:103)
at org.jboss.arquillian.core.impl.EventContextImpl.proceed(EventContextImpl.java:90)
at org.jboss.arquillian.container.impl.client.ContainerDeploymentContextHandler.createDeploymentContext(ContainerDeploymentContextHandler.java:71)
at java.base/jdk.internal.reflect.NativeMethodAccessorImpl.invoke0(Native Method)
at java.base/jdk.internal.reflect.NativeMethodAccessorImpl.invoke(NativeMethodAccessorImpl.java:62)
at java.base/jdk.internal.reflect.DelegatingMethodAccessorImpl.invoke(DelegatingMethodAccessorImpl.java:43)
at java.base/java.lang.reflect.Method.invoke(Method.java:566)
at org.jboss.arquillian.core.impl.ObserverImpl.invoke(ObserverImpl.java:86)
at org.jboss.arquillian.core.impl.EventContextImpl.proceed(EventContextImpl.java:95)
at org.jboss.arquillian.container.impl.client.ContainerDeploymentContextHandler.createContainerContext(ContainerDeploymentContextHandler.java:54)
at java.base/jdk.internal.reflect.NativeMethodAccessorImpl.invoke0(Native Method)
at java.base/jdk.internal.reflect.NativeMethodAccessorImpl.invoke(NativeMethodAccessorImpl.java:62)
at java.base/jdk.internal.reflect.DelegatingMethodAccessorImpl.invoke(DelegatingMethodAccessorImpl.java:43)
at java.base/java.lang.reflect.Method.invoke(Method.java:566)
at org.jboss.arquillian.core.impl.ObserverImpl.invoke(ObserverImpl.java:86)
at org.jboss.arquillian.core.impl.EventContextImpl.proceed(EventContextImpl.java:95)
at org.jboss.arquillian.container.impl.client.container.DeploymentExceptionHandler.verifyExpectedExceptionDuringDeploy(DeploymentExceptionHandler.java:47)
at java.base/jdk.internal.reflect.NativeMethodAccessorImpl.invoke0(Native Method)
at java.base/jdk.internal.reflect.NativeMethodAccessorImpl.invoke(NativeMethodAccessorImpl.java:62)
at java.base/jdk.internal.reflect.DelegatingMethodAccessorImpl.invoke(DelegatingMethodAccessorImpl.java:43)
at java.base/java.lang.reflect.Method.invoke(Method.java:566)
at org.jboss.arquillian.core.impl.ObserverImpl.invoke(ObserverImpl.java:86)
at org.jboss.arquillian.core.impl.EventContextImpl.proceed(EventContextImpl.java:95)
at org.jboss.arquillian.core.impl.ManagerImpl.fire(ManagerImpl.java:133)
at org.jboss.arquillian.core.impl.ManagerImpl.fire(ManagerImpl.java:105)
at org.jboss.arquillian.core.impl.EventImpl.fire(EventImpl.java:62)
at org.jboss.arquillian.container.impl.client.container.ContainerDeployController$1.perform(ContainerDeployController.java:92)
at org.jboss.arquillian.container.impl.client.container.ContainerDeployController$1.perform(ContainerDeployController.java:77)
at org.jboss.arquillian.container.impl.client.container.ContainerDeployController.forEachDeployment(ContainerDeployController.java:232)
at org.jboss.arquillian.container.impl.client.container.ContainerDeployController.forEachManagedDeployment(ContainerDeployController.java:212)
at org.jboss.arquillian.container.impl.client.container.ContainerDeployController.deployManaged(ContainerDeployController.java:77)
at java.base/jdk.internal.reflect.NativeMethodAccessorImpl.invoke0(Native Method)
at java.base/jdk.internal.reflect.NativeMethodAccessorImpl.invoke(NativeMethodAccessorImpl.java:62)
at java.base/jdk.internal.reflect.DelegatingMethodAccessorImpl.invoke(DelegatingMethodAccessorImpl.java:43)
at java.base/java.lang.reflect.Method.invoke(Method.java:566)
at org.jboss.arquillian.core.impl.ObserverImpl.invoke(ObserverImpl.java:86)
at org.jboss.arquillian.core.impl.EventContextImpl.invokeObservers(EventContextImpl.java:103)
at org.jboss.arquillian.core.impl.EventContextImpl.proceed(EventContextImpl.java:90)
at org.jboss.arquillian.core.impl.ManagerImpl.fire(ManagerImpl.java:133)
at org.jboss.arquillian.core.impl.ManagerImpl.fire(ManagerImpl.java:105)
at org.jboss.arquillian.core.impl.EventImpl.fire(EventImpl.java:62)
at org.jboss.arquillian.container.test.impl.client.ContainerEventController.execute(ContainerEventController.java:96)
at java.base/jdk.internal.reflect.NativeMethodAccessorImpl.invoke0(Native Method)
at java.base/jdk.internal.reflect.NativeMethodAccessorImpl.invoke(NativeMethodAccessorImpl.java:62)
at java.base/jdk.internal.reflect.DelegatingMethodAccessorImpl.invoke(DelegatingMethodAccessorImpl.java:43)
at java.base/java.lang.reflect.Method.invoke(Method.java:566)
at org.jboss.arquillian.core.impl.ObserverImpl.invoke(ObserverImpl.java:86)
at org.jboss.arquillian.core.impl.EventContextImpl.invokeObservers(EventContextImpl.java:103)
at org.jboss.arquillian.core.impl.EventContextImpl.proceed(EventContextImpl.java:90)
at org.jboss.arquillian.test.impl.TestContextHandler.createClassContext(TestContextHandler.java:83)
at java.base/jdk.internal.reflect.NativeMethodAccessorImpl.invoke0(Native Method)
at java.base/jdk.internal.reflect.NativeMethodAccessorImpl.invoke(NativeMethodAccessorImpl.java:62)
at java.base/jdk.internal.reflect.DelegatingMethodAccessorImpl.invoke(DelegatingMethodAccessorImpl.java:43)
at java.base/java.lang.reflect.Method.invoke(Method.java:566)
at org.jboss.arquillian.core.impl.ObserverImpl.invoke(ObserverImpl.java:86)
at org.jboss.arquillian.core.impl.EventContextImpl.proceed(EventContextImpl.java:95)
at org.jboss.arquillian.test.impl.TestContextHandler.createSuiteContext(TestContextHandler.java:69)
at java.base/jdk.internal.reflect.NativeMethodAccessorImpl.invoke0(Native Method)
at java.base/jdk.internal.reflect.NativeMethodAccessorImpl.invoke(NativeMethodAccessorImpl.java:62)
at java.base/jdk.internal.reflect.DelegatingMethodAccessorImpl.invoke(DelegatingMethodAccessorImpl.java:43)
at java.base/java.lang.reflect.Method.invoke(Method.java:566)
at org.jboss.arquillian.core.impl.ObserverImpl.invoke(ObserverImpl.java:86)
at org.jboss.arquillian.core.impl.EventContextImpl.proceed(EventContextImpl.java:95)
at org.jboss.arquillian.core.impl.ManagerImpl.fire(ManagerImpl.java:133)
at org.jboss.arquillian.core.impl.ManagerImpl.fire(ManagerImpl.java:105)
at org.jboss.arquillian.test.impl.EventTestRunnerAdaptor.beforeClass(EventTestRunnerAdaptor.java:89)
at org.jboss.arquillian.junit.Arquillian$2.evaluate(Arquillian.java:163)
at org.jboss.arquillian.junit.Arquillian.multiExecute(Arquillian.java:350)
at org.jboss.arquillian.junit.Arquillian.access$200(Arquillian.java:54)
at org.jboss.arquillian.junit.Arquillian$3.evaluate(Arquillian.java:177)
at org.junit.runners.ParentRunner$3.evaluate(ParentRunner.java:306)
at org.junit.runners.ParentRunner.run(ParentRunner.java:413)
at org.jboss.arquillian.junit.Arquillian.run(Arquillian.java:115)
at org.apache.maven.surefire.junit4.JUnit4Provider.execute(JUnit4Provider.java:365)
at org.apache.maven.surefire.junit4.JUnit4Provider.executeWithRerun(JUnit4Provider.java:273)
at org.apache.maven.surefire.junit4.JUnit4Provider.executeTestSet(JUnit4Provider.java:238)
at org.apache.maven.surefire.junit4.JUnit4Provider.invoke(JUnit4Provider.java:159)
at org.apache.maven.surefire.booter.ForkedBooter.invokeProviderInSameClassLoader(ForkedBooter.java:384)
at org.apache.maven.surefire.booter.ForkedBooter.runSuitesInProcess(ForkedBooter.java:345)
at org.apache.maven.surefire.booter.ForkedBooter.execute(ForkedBooter.java:126)
at org.apache.maven.surefire.booter.ForkedBooter.main(ForkedBooter.java:418)
[INFO]
[INFO] Results:
[INFO]
[ERROR] Errors:
[ERROR] IIOPSslInvocationTestCase.org.jboss.as.test.iiopssl.basic.IIOPSslInvocationTestCase » Deployment
The test is run with Java 11;
We get the same error also when using WF Testsuite:
cd testsuite mvn install -Dtest=IIOPSslInvocationTestCase -Denforcer.skip=true
same outcome:
[INFO] --- maven-surefire-plugin:2.22.2:test (tests-iiop-multi-node.surefire) @ wildfly-ts-integ-iiop ---
[INFO]
[INFO] -------------------------------------------------------
[INFO] T E S T S
[INFO] -------------------------------------------------------
[INFO] Running org.jboss.as.test.iiopssl.basic.IIOPSslInvocationTestCase
[ERROR] Tests run: 1, Failures: 0, Errors: 1, Skipped: 0, Time elapsed: 7.543 s <<< FAILURE! - in org.jboss.as.test.iiopssl.basic.IIOPSslInvocationTestCase
[ERROR] org.jboss.as.test.iiopssl.basic.IIOPSslInvocationTestCase Time elapsed: 7.541 s <<< ERROR!
org.jboss.arquillian.container.spi.client.container.DeploymentException:
Cannot deploy server.jar: {"WFLYCTL0062: Composite operation failed and was rolled back. Steps that failed:" => {"Operation step-1" => {"WFLYCTL0080: Failed services" => {"jboss.deployment.unit.\"server.jar\".component.IIOPSslStatelessBean.EjbIIOPService" => "org.omg.CORBA.COMM_FAILURE: vmcid: SUN minor code: 201 completed: No
Caused by: org.omg.CORBA.COMM_FAILURE: vmcid: SUN minor code: 201 completed: No
Caused by: java.net.ConnectException: Connection refused"}}}}
at org.jboss.as.arquillian.container.ArchiveDeployer.deployInternal(ArchiveDeployer.java:184)
at org.jboss.as.arquillian.container.ArchiveDeployer.deployInternal(ArchiveDeployer.java:162)
at org.jboss.as.arquillian.container.ArchiveDeployer.deploy(ArchiveDeployer.java:91)
at org.jboss.as.arquillian.container.CommonDeployableContainer.deploy(CommonDeployableContainer.java:255)
at org.jboss.arquillian.container.impl.client.container.ContainerDeployController$3.call(ContainerDeployController.java:151)
at org.jboss.arquillian.container.impl.client.container.ContainerDeployController$3.call(ContainerDeployController.java:118)
at org.jboss.arquillian.container.impl.client.container.ContainerDeployController.executeOperation(ContainerDeployController.java:239)
at org.jboss.arquillian.container.impl.client.container.ContainerDeployController.deploy(ContainerDeployController.java:118)
at java.base/jdk.internal.reflect.NativeMethodAccessorImpl.invoke0(Native Method)
at java.base/jdk.internal.reflect.NativeMethodAccessorImpl.invoke(NativeMethodAccessorImpl.java:62)
at java.base/jdk.internal.reflect.DelegatingMethodAccessorImpl.invoke(DelegatingMethodAccessorImpl.java:43)
at java.base/java.lang.reflect.Method.invoke(Method.java:566)
at org.jboss.arquillian.core.impl.ObserverImpl.invoke(ObserverImpl.java:86)
at org.jboss.arquillian.core.impl.EventContextImpl.invokeObservers(EventContextImpl.java:103)
at org.jboss.arquillian.core.impl.EventContextImpl.proceed(EventContextImpl.java:90)
at org.jboss.arquillian.container.impl.client.ContainerDeploymentContextHandler.createDeploymentContext(ContainerDeploymentContextHandler.java:71)
at java.base/jdk.internal.reflect.NativeMethodAccessorImpl.invoke0(Native Method)
at java.base/jdk.internal.reflect.NativeMethodAccessorImpl.invoke(NativeMethodAccessorImpl.java:62)
at java.base/jdk.internal.reflect.DelegatingMethodAccessorImpl.invoke(DelegatingMethodAccessorImpl.java:43)
at java.base/java.lang.reflect.Method.invoke(Method.java:566)
at org.jboss.arquillian.core.impl.ObserverImpl.invoke(ObserverImpl.java:86)
at org.jboss.arquillian.core.impl.EventContextImpl.proceed(EventContextImpl.java:95)
at org.jboss.arquillian.container.impl.client.ContainerDeploymentContextHandler.createContainerContext(ContainerDeploymentContextHandler.java:54)
at java.base/jdk.internal.reflect.NativeMethodAccessorImpl.invoke0(Native Method)
at java.base/jdk.internal.reflect.NativeMethodAccessorImpl.invoke(NativeMethodAccessorImpl.java:62)
at java.base/jdk.internal.reflect.DelegatingMethodAccessorImpl.invoke(DelegatingMethodAccessorImpl.java:43)
at java.base/java.lang.reflect.Method.invoke(Method.java:566)
at org.jboss.arquillian.core.impl.ObserverImpl.invoke(ObserverImpl.java:86)
at org.jboss.arquillian.core.impl.EventContextImpl.proceed(EventContextImpl.java:95)
at org.jboss.arquillian.container.impl.client.container.DeploymentExceptionHandler.verifyExpectedExceptionDuringDeploy(DeploymentExceptionHandler.java:47)
at java.base/jdk.internal.reflect.NativeMethodAccessorImpl.invoke0(Native Method)
at java.base/jdk.internal.reflect.NativeMethodAccessorImpl.invoke(NativeMethodAccessorImpl.java:62)
at java.base/jdk.internal.reflect.DelegatingMethodAccessorImpl.invoke(DelegatingMethodAccessorImpl.java:43)
at java.base/java.lang.reflect.Method.invoke(Method.java:566)
at org.jboss.arquillian.core.impl.ObserverImpl.invoke(ObserverImpl.java:86)
at org.jboss.arquillian.core.impl.EventContextImpl.proceed(EventContextImpl.java:95)
at org.jboss.arquillian.core.impl.ManagerImpl.fire(ManagerImpl.java:133)
at org.jboss.arquillian.core.impl.ManagerImpl.fire(ManagerImpl.java:105)
at org.jboss.arquillian.core.impl.EventImpl.fire(EventImpl.java:62)
at org.jboss.arquillian.container.impl.client.container.ContainerDeployController$1.perform(ContainerDeployController.java:92)
at org.jboss.arquillian.container.impl.client.container.ContainerDeployController$1.perform(ContainerDeployController.java:77)
at org.jboss.arquillian.container.impl.client.container.ContainerDeployController.forEachDeployment(ContainerDeployController.java:232)
at org.jboss.arquillian.container.impl.client.container.ContainerDeployController.forEachManagedDeployment(ContainerDeployController.java:212)
at org.jboss.arquillian.container.impl.client.container.ContainerDeployController.deployManaged(ContainerDeployController.java:77)
at java.base/jdk.internal.reflect.NativeMethodAccessorImpl.invoke0(Native Method)
at java.base/jdk.internal.reflect.NativeMethodAccessorImpl.invoke(NativeMethodAccessorImpl.java:62)
at java.base/jdk.internal.reflect.DelegatingMethodAccessorImpl.invoke(DelegatingMethodAccessorImpl.java:43)
at java.base/java.lang.reflect.Method.invoke(Method.java:566)
at org.jboss.arquillian.core.impl.ObserverImpl.invoke(ObserverImpl.java:86)
at org.jboss.arquillian.core.impl.EventContextImpl.invokeObservers(EventContextImpl.java:103)
at org.jboss.arquillian.core.impl.EventContextImpl.proceed(EventContextImpl.java:90)
at org.jboss.arquillian.core.impl.ManagerImpl.fire(ManagerImpl.java:133)
at org.jboss.arquillian.core.impl.ManagerImpl.fire(ManagerImpl.java:105)
at org.jboss.arquillian.core.impl.EventImpl.fire(EventImpl.java:62)
at org.jboss.arquillian.container.test.impl.client.ContainerEventController.execute(ContainerEventController.java:96)
at java.base/jdk.internal.reflect.NativeMethodAccessorImpl.invoke0(Native Method)
at java.base/jdk.internal.reflect.NativeMethodAccessorImpl.invoke(NativeMethodAccessorImpl.java:62)
at java.base/jdk.internal.reflect.DelegatingMethodAccessorImpl.invoke(DelegatingMethodAccessorImpl.java:43)
at java.base/java.lang.reflect.Method.invoke(Method.java:566)
at org.jboss.arquillian.core.impl.ObserverImpl.invoke(ObserverImpl.java:86)
at org.jboss.arquillian.core.impl.EventContextImpl.invokeObservers(EventContextImpl.java:103)
at org.jboss.arquillian.core.impl.EventContextImpl.proceed(EventContextImpl.java:90)
at org.jboss.arquillian.test.impl.TestContextHandler.createClassContext(TestContextHandler.java:83)
at java.base/jdk.internal.reflect.NativeMethodAccessorImpl.invoke0(Native Method)
at java.base/jdk.internal.reflect.NativeMethodAccessorImpl.invoke(NativeMethodAccessorImpl.java:62)
at java.base/jdk.internal.reflect.DelegatingMethodAccessorImpl.invoke(DelegatingMethodAccessorImpl.java:43)
at java.base/java.lang.reflect.Method.invoke(Method.java:566)
at org.jboss.arquillian.core.impl.ObserverImpl.invoke(ObserverImpl.java:86)
at org.jboss.arquillian.core.impl.EventContextImpl.proceed(EventContextImpl.java:95)
at org.jboss.arquillian.test.impl.TestContextHandler.createSuiteContext(TestContextHandler.java:69)
at java.base/jdk.internal.reflect.NativeMethodAccessorImpl.invoke0(Native Method)
at java.base/jdk.internal.reflect.NativeMethodAccessorImpl.invoke(NativeMethodAccessorImpl.java:62)
at java.base/jdk.internal.reflect.DelegatingMethodAccessorImpl.invoke(DelegatingMethodAccessorImpl.java:43)
at java.base/java.lang.reflect.Method.invoke(Method.java:566)
at org.jboss.arquillian.core.impl.ObserverImpl.invoke(ObserverImpl.java:86)
at org.jboss.arquillian.core.impl.EventContextImpl.proceed(EventContextImpl.java:95)
at org.jboss.arquillian.core.impl.ManagerImpl.fire(ManagerImpl.java:133)
at org.jboss.arquillian.core.impl.ManagerImpl.fire(ManagerImpl.java:105)
at org.jboss.arquillian.test.impl.EventTestRunnerAdaptor.beforeClass(EventTestRunnerAdaptor.java:89)
at org.jboss.arquillian.junit.Arquillian$2.evaluate(Arquillian.java:163)
at org.jboss.arquillian.junit.Arquillian.multiExecute(Arquillian.java:350)
at org.jboss.arquillian.junit.Arquillian.access$200(Arquillian.java:54)
at org.jboss.arquillian.junit.Arquillian$3.evaluate(Arquillian.java:177)
at org.junit.runners.ParentRunner$3.evaluate(ParentRunner.java:306)
at org.junit.runners.ParentRunner.run(ParentRunner.java:413)
at org.jboss.arquillian.junit.Arquillian.run(Arquillian.java:115)
at org.apache.maven.surefire.junit4.JUnit4Provider.execute(JUnit4Provider.java:365)
at org.apache.maven.surefire.junit4.JUnit4Provider.executeWithRerun(JUnit4Provider.java:273)
at org.apache.maven.surefire.junit4.JUnit4Provider.executeTestSet(JUnit4Provider.java:238)
at org.apache.maven.surefire.junit4.JUnit4Provider.invoke(JUnit4Provider.java:159)
at org.apache.maven.surefire.booter.ForkedBooter.invokeProviderInSameClassLoader(ForkedBooter.java:384)
at org.apache.maven.surefire.booter.ForkedBooter.runSuitesInProcess(ForkedBooter.java:345)
at org.apache.maven.surefire.booter.ForkedBooter.execute(ForkedBooter.java:126)
at org.apache.maven.surefire.booter.ForkedBooter.main(ForkedBooter.java:418)
[INFO]
[INFO] Results:
[INFO]
[ERROR] Errors:
[ERROR] IIOPSslInvocationTestCase.org.jboss.as.test.iiopssl.basic.IIOPSslInvocationTestCase » Deployment