Uploaded image for project: 'JBoss Enterprise Application Platform'
  1. JBoss Enterprise Application Platform
  2. JBEAP-21367

VaultPasswordsInCLITestCase fails with Elytron profile

    XMLWordPrintable

Details

    • Bug
    • Resolution: Done
    • Major
    • 7.4.0.GA
    • None
    • Security, Test Suite
    • None

    Description

      cd testsuite/manualmode/
      mvn test -Delytron -Dtest=VaultPasswordsInCLITestCase

      [INFO] Running org.jboss.as.test.manualmode.vault.VaultPasswordsInCLITestCase
      [ERROR] Tests run: 2, Failures: 0, Errors: 2, Skipped: 0, Time elapsed: 0.006 s <<< FAILURE! - in org.jboss.as.test.manualmode.vault.VaultPasswordsInCLITestCase
      [ERROR] org.jboss.as.test.manualmode.vault.VaultPasswordsInCLITestCase  Time elapsed: 0.005 s  <<< ERROR!
      java.lang.RuntimeException: 
      {
          "WFLYCTL0412: Required services that are not installed:" => ["org.wildfly.core.management.security.realm.ManagementRealm"],
          "WFLYCTL0180: Services with missing/unavailable dependencies" => ["jboss.remoting.server.management is missing [org.wildfly.core.management.security.realm.ManagementRealm]"]
      }
      	at org.jboss.as.test.integration.security.common.CoreUtils.applyUpdate(CoreUtils.java:265)
      	at org.jboss.as.test.manualmode.vault.VaultPasswordsInCLITestCase$ManagementInterfacesSetup.setup(VaultPasswordsInCLITestCase.java:215)
      	at org.jboss.as.test.manualmode.vault.VaultPasswordsInCLITestCase.prepareServer(VaultPasswordsInCLITestCase.java:107)
      	at sun.reflect.NativeMethodAccessorImpl.invoke0(Native Method)
      	at sun.reflect.NativeMethodAccessorImpl.invoke(NativeMethodAccessorImpl.java:62)
      	at sun.reflect.DelegatingMethodAccessorImpl.invoke(DelegatingMethodAccessorImpl.java:43)
      	at java.lang.reflect.Method.invoke(Method.java:498)
      	at org.junit.runners.model.FrameworkMethod$1.runReflectiveCall(FrameworkMethod.java:50)
      	at org.junit.internal.runners.model.ReflectiveCallable.run(ReflectiveCallable.java:12)
      	at org.junit.runners.model.FrameworkMethod.invokeExplosively(FrameworkMethod.java:47)
      	at org.junit.internal.runners.statements.RunBefores.evaluate(RunBefores.java:24)
      	at org.junit.internal.runners.statements.RunAfters.evaluate(RunAfters.java:27)
      	at org.junit.runners.ParentRunner.run(ParentRunner.java:363)
      	at org.wildfly.core.testrunner.WildflyTestRunner.run(WildflyTestRunner.java:109)
      	at org.junit.runners.Suite.runChild(Suite.java:128)
      	at org.junit.runners.Suite.runChild(Suite.java:27)
      	at org.junit.runners.ParentRunner$3.run(ParentRunner.java:290)
      	at org.junit.runners.ParentRunner$1.schedule(ParentRunner.java:71)
      	at org.junit.runners.ParentRunner.runChildren(ParentRunner.java:288)
      	at org.junit.runners.ParentRunner.access$000(ParentRunner.java:58)
      	at org.junit.runners.ParentRunner$2.evaluate(ParentRunner.java:268)
      	at org.junit.runners.ParentRunner.run(ParentRunner.java:363)
      	at org.apache.maven.surefire.junitcore.JUnitCore.run(JUnitCore.java:55)
      	at org.apache.maven.surefire.junitcore.JUnitCoreWrapper.createRequestAndRun(JUnitCoreWrapper.java:137)
      	at org.apache.maven.surefire.junitcore.JUnitCoreWrapper.executeEager(JUnitCoreWrapper.java:107)
      	at org.apache.maven.surefire.junitcore.JUnitCoreWrapper.execute(JUnitCoreWrapper.java:83)
      	at org.apache.maven.surefire.junitcore.JUnitCoreWrapper.execute(JUnitCoreWrapper.java:75)
      	at org.apache.maven.surefire.junitcore.JUnitCoreProvider.invoke(JUnitCoreProvider.java:158)
      	at org.apache.maven.surefire.booter.ForkedBooter.invokeProviderInSameClassLoader(ForkedBooter.java:383)
      	at org.apache.maven.surefire.booter.ForkedBooter.runSuitesInProcess(ForkedBooter.java:344)
      	at org.apache.maven.surefire.booter.ForkedBooter.execute(ForkedBooter.java:125)
      	at org.apache.maven.surefire.booter.ForkedBooter.main(ForkedBooter.java:417)
      
      [ERROR] org.jboss.as.test.manualmode.vault.VaultPasswordsInCLITestCase  Time elapsed: 0.006 s  <<< ERROR!
      java.io.IOException: java.net.ConnectException: WFLYPRT0053: Could not connect to remote://127.0.0.1:9999. The connection failed
      	at org.jboss.as.controller.client.impl.AbstractModelControllerClient.executeForResult(AbstractModelControllerClient.java:149)
      	at org.jboss.as.controller.client.impl.AbstractModelControllerClient.execute(AbstractModelControllerClient.java:80)
      	at org.jboss.as.test.integration.security.common.CoreUtils.applyUpdate(CoreUtils.java:257)
      	at org.jboss.as.test.manualmode.vault.VaultPasswordsInCLITestCase.resetHttpInterfaceConfiguration(VaultPasswordsInCLITestCase.java:274)
      	at org.jboss.as.test.manualmode.vault.VaultPasswordsInCLITestCase.resetConfigurationForNativeInterface(VaultPasswordsInCLITestCase.java:150)
      	at sun.reflect.NativeMethodAccessorImpl.invoke0(Native Method)
      	at sun.reflect.NativeMethodAccessorImpl.invoke(NativeMethodAccessorImpl.java:62)
      	at sun.reflect.DelegatingMethodAccessorImpl.invoke(DelegatingMethodAccessorImpl.java:43)
      	at java.lang.reflect.Method.invoke(Method.java:498)
      	at org.junit.runners.model.FrameworkMethod$1.runReflectiveCall(FrameworkMethod.java:50)
      	at org.junit.internal.runners.model.ReflectiveCallable.run(ReflectiveCallable.java:12)
      	at org.junit.runners.model.FrameworkMethod.invokeExplosively(FrameworkMethod.java:47)
      	at org.junit.internal.runners.statements.RunAfters.evaluate(RunAfters.java:33)
      	at org.junit.runners.ParentRunner.run(ParentRunner.java:363)
      	at org.wildfly.core.testrunner.WildflyTestRunner.run(WildflyTestRunner.java:109)
      	at org.junit.runners.Suite.runChild(Suite.java:128)
      	at org.junit.runners.Suite.runChild(Suite.java:27)
      	at org.junit.runners.ParentRunner$3.run(ParentRunner.java:290)
      	at org.junit.runners.ParentRunner$1.schedule(ParentRunner.java:71)
      	at org.junit.runners.ParentRunner.runChildren(ParentRunner.java:288)
      	at org.junit.runners.ParentRunner.access$000(ParentRunner.java:58)
      	at org.junit.runners.ParentRunner$2.evaluate(ParentRunner.java:268)
      	at org.junit.runners.ParentRunner.run(ParentRunner.java:363)
      	at org.apache.maven.surefire.junitcore.JUnitCore.run(JUnitCore.java:55)
      	at org.apache.maven.surefire.junitcore.JUnitCoreWrapper.createRequestAndRun(JUnitCoreWrapper.java:137)
      	at org.apache.maven.surefire.junitcore.JUnitCoreWrapper.executeEager(JUnitCoreWrapper.java:107)
      	at org.apache.maven.surefire.junitcore.JUnitCoreWrapper.execute(JUnitCoreWrapper.java:83)
      	at org.apache.maven.surefire.junitcore.JUnitCoreWrapper.execute(JUnitCoreWrapper.java:75)
      	at org.apache.maven.surefire.junitcore.JUnitCoreProvider.invoke(JUnitCoreProvider.java:158)
      	at org.apache.maven.surefire.booter.ForkedBooter.invokeProviderInSameClassLoader(ForkedBooter.java:383)
      	at org.apache.maven.surefire.booter.ForkedBooter.runSuitesInProcess(ForkedBooter.java:344)
      	at org.apache.maven.surefire.booter.ForkedBooter.execute(ForkedBooter.java:125)
      	at org.apache.maven.surefire.booter.ForkedBooter.main(ForkedBooter.java:417)
      Caused by: java.net.ConnectException: WFLYPRT0053: Could not connect to remote://127.0.0.1:9999. The connection failed
      	at org.jboss.as.protocol.ProtocolConnectionUtils.connectSync(ProtocolConnectionUtils.java:128)
      	at org.jboss.as.protocol.ProtocolConnectionManager$EstablishingConnection.connect(ProtocolConnectionManager.java:259)
      	at org.jboss.as.protocol.ProtocolConnectionManager.connect(ProtocolConnectionManager.java:70)
      	at org.jboss.as.protocol.mgmt.ManagementClientChannelStrategy$Establishing.getChannel(ManagementClientChannelStrategy.java:167)
      	at org.jboss.as.controller.client.impl.RemotingModelControllerClient.getOrCreateChannel(RemotingModelControllerClient.java:146)
      	at org.jboss.as.controller.client.impl.RemotingModelControllerClient$1.getChannel(RemotingModelControllerClient.java:60)
      	at org.jboss.as.protocol.mgmt.ManagementChannelHandler.executeRequest(ManagementChannelHandler.java:135)
      	at org.jboss.as.protocol.mgmt.ManagementChannelHandler.executeRequest(ManagementChannelHandler.java:110)
      	at org.jboss.as.controller.client.impl.AbstractModelControllerClient.executeRequest(AbstractModelControllerClient.java:263)
      	at org.jboss.as.controller.client.impl.AbstractModelControllerClient.execute(AbstractModelControllerClient.java:168)
      	at org.jboss.as.controller.client.impl.AbstractModelControllerClient.executeForResult(AbstractModelControllerClient.java:147)
      	... 32 more
      Caused by: java.net.ConnectException: Connection refused
      	at sun.nio.ch.SocketChannelImpl.checkConnect(Native Method)
      	at sun.nio.ch.SocketChannelImpl.finishConnect(SocketChannelImpl.java:717)
      	at org.xnio.nio.WorkerThread$ConnectHandle.handleReady(WorkerThread.java:327)
      	at org.xnio.nio.WorkerThread.run(WorkerThread.java:591)
      	at ...asynchronous invocation...(Unknown Source)
      	at org.jboss.remoting3.EndpointImpl.connect(EndpointImpl.java:571)
      	at org.jboss.remoting3.EndpointImpl.connect(EndpointImpl.java:533)
      	at org.jboss.remoting3.EndpointImpl.connect(EndpointImpl.java:521)
      	at org.jboss.as.protocol.ProtocolConnectionUtils.connect(ProtocolConnectionUtils.java:204)
      	at org.jboss.as.protocol.ProtocolConnectionUtils.connectSync(ProtocolConnectionUtils.java:120)
      	... 42 more
      
      [INFO] 
      [INFO] Results:
      [INFO] 
      [ERROR] Errors: 
      [ERROR] org.jboss.as.test.manualmode.vault.VaultPasswordsInCLITestCase.org.jboss.as.test.manualmode.vault.VaultPasswordsInCLITestCase
      [ERROR]   Run 1: VaultPasswordsInCLITestCase.prepareServer:107 » Runtime {
          "WFLYCTL0412: Re...
      [ERROR]   Run 2: VaultPasswordsInCLITestCase.resetConfigurationForNativeInterface:150->resetHttpInterfaceConfiguration:274 » IO
      [INFO] 
      [INFO] 
      [ERROR] Tests run: 1, Failures: 0, Errors: 1, Skipped: 0
      [INFO] 
      [INFO] ------------------------------------------------------------------------
      [INFO] BUILD FAILURE
      

      Attachments

        Issue Links

          Activity

            People

              pberan@redhat.com Petr Beran
              mchoma@redhat.com Martin Choma
              Votes:
              0 Vote for this issue
              Watchers:
              2 Start watching this issue

              Dates

                Created:
                Updated:
                Resolved: