Uploaded image for project: 'JBoss Enterprise Application Platform'
  1. JBoss Enterprise Application Platform
  2. JBEAP-19317

AssertionError exception is thrown by SqlFunctionMetadataBuilderContributorIllegalClassArgumentTest when executing on Eclipse OpenJ9 VM AdoptOpenJDK (v. 11.0.6)

    Details

    • Type: Bug
    • Status: New (View Workflow)
    • Priority: Major
    • Resolution: Unresolved
    • Affects Version/s: 7.3.0.GA.CR4
    • Fix Version/s: None
    • Component/s: Hibernate
    • Labels:
      None

      Description

      This is a clone of https://hibernate.atlassian.net/browse/HHH-13965

      When using Eclipse OpenJ9 VM AdoptOpenJDK (see Environment details), a java.lang.AssertionError exception is thrown by SqlFunctionMetadataBuilderContributorIllegalClassArgumentTest when the following commands are executed to run the Hibernate ORM tests.

      # make gradle ignore test failures
      echo -e '\ntest { ignoreFailures=true }' >> hibernate-core/hibernate-core.gradle
      echo -e '\ntest { ignoreFailures=true }' >> hibernate-agroal/hibernate-agroal.gradle
      echo -e '\ntest { ignoreFailures=true }' >> hibernate-c3p0/hibernate-c3p0.gradle
      echo -e '\ntest { ignoreFailures=true }' >> hibernate-ehcache/hibernate-ehcache.gradle
      echo -e '\ntest { ignoreFailures=true }' >> hibernate-envers/hibernate-envers.gradle
      echo -e '\ntest { ignoreFailures=true }' >> hibernate-proxool/hibernate-proxool.gradle
      
      ./gradlew test -Dmaven.repo.url=http://jcenter.bintray.com -Dgradle.plugin.url=https://plugins.gradle.org/m2/ \
              -Dhibernate.show_sql=true -Dhibernate.format_sql=true --info --stacktrace -x :hibernate-core:classes \
              -x :hibernate-envers:classes -x :hibernate-ehcache:test -x :hibernate-hikaricp:test -x :hibernate-jcache:test \
              -x :hibernate-vibur:test -x :hibernate-osgi:test -x :documentation:test -x :hibernate-spatial:test \
              -x :hibernate-testing:test --project-cache-dir=/tmp --continue -g local-home
      

      Environment:

      openjdk version "11.0.6" 2020-01-14
      OpenJDK Runtime Environment AdoptOpenJDK (build 11.0.6+10)
      Eclipse OpenJ9 VM AdoptOpenJDK (build openj9-0.18.1, JRE 11 Linux amd64-64-Bit Compressed References 20200122_441 (JIT enabled, AOT enabled)
      OpenJ9 - 51a5857d2
      OMR - 7a1b0239a
      JCL - da35e0c380 based on jdk-11.0.6+10)

      OS name: "linux", version: "3.10.0-1062.el7.x86_64", arch: "amd64", family: "unix"

      Stack trace:

      java.lang.AssertionError
      	at org.junit.Assert.fail(Assert.java:86)
      	at org.junit.Assert.assertTrue(Assert.java:41)
      	at org.junit.Assert.assertTrue(Assert.java:52)
      	at org.hibernate.boot.spi.metadatabuildercontributor.SqlFunctionMetadataBuilderContributorIllegalClassArgumentTest.buildEntityManagerFactory(SqlFunctionMetadataBuilderContributorIllegalClassArgumentTest.java:38)
      	at jdk.internal.reflect.GeneratedMethodAccessor22.invoke(Unknown Source)
      	at java.base/jdk.internal.reflect.DelegatingMethodAccessorImpl.invoke(DelegatingMethodAccessorImpl.java:43)
      	at java.base/java.lang.reflect.Method.invoke(Method.java:566)
      	at org.junit.runners.model.FrameworkMethod$1.runReflectiveCall(FrameworkMethod.java:50)
      	at org.junit.internal.runners.model.ReflectiveCallable.run(ReflectiveCallable.java:12)
      	at org.junit.runners.model.FrameworkMethod.invokeExplosively(FrameworkMethod.java:47)
      	at org.junit.internal.runners.statements.RunBefores.evaluate(RunBefores.java:24)
      	at org.junit.internal.runners.statements.RunAfters.evaluate(RunAfters.java:27)
      	at org.junit.internal.runners.statements.FailOnTimeout$CallableStatement.call(FailOnTimeout.java:298)
      	at org.junit.internal.runners.statements.FailOnTimeout$CallableStatement.call(FailOnTimeout.java:292)
      	at java.base/java.util.concurrent.FutureTask.run(FutureTask.java:264)
      	at java.base/java.lang.Thread.run(Thread.java:834)...
      

        Gliffy Diagrams

          Attachments

            Issue Links

              Activity

                People

                • Assignee:
                  gbadner Gail Badner
                  Reporter:
                  fburzigo Fabio Burzigotti
                • Votes:
                  0 Vote for this issue
                  Watchers:
                  1 Start watching this issue

                  Dates

                  • Created:
                    Updated: