Uploaded image for project: 'Infinispan'
  1. Infinispan
  2. ISPN-4689

NumOwnersNodeCrashInSequenceTest random failures

    XMLWordPrintable

Details

    • Bug
    • Status: Closed (View Workflow)
    • Blocker
    • Resolution: Done
    • 7.0.0.Beta1
    • 7.0.0.CR1
    • Test Suite
    • None

    Description

      Happened in my local box:

      Tests run: 5277, Failures: 1, Errors: 0, Skipped: 0, Time elapsed: 366.401 sec <<< FAILURE! - in TestSuite
      testNodeCrashedBeforeStFinished4(org.infinispan.partitionhandling.NumOwnersNodeCrashInSequenceTest)  Time elapsed: 1.105 sec  <<< FAILURE!
      java.lang.AssertionError:
              at org.testng.AssertJUnit.fail(AssertJUnit.java:59)
              at org.testng.AssertJUnit.assertTrue(AssertJUnit.java:24)
              at org.testng.AssertJUnit.assertTrue(AssertJUnit.java:33)
              at org.infinispan.test.AbstractInfinispanTest.eventually(AbstractInfinispanTest.java:91)
              at org.infinispan.test.AbstractInfinispanTest.eventually(AbstractInfinispanTest.java:74)
              at org.infinispan.test.AbstractInfinispanTest.eventually(AbstractInfinispanTest.java:406)
              at org.infinispan.partitionhandling.NumOwnersNodeCrashInSequenceTest.testNodeCrashedBeforeStFinished(NumOwnersNodeCrashInSequenceTest.java:153)
              at org.infinispan.partitionhandling.NumOwnersNodeCrashInSequenceTest.testNodeCrashedBeforeStFinished4(NumOwnersNodeCrashInSequenceTest.java:81)
              at sun.reflect.NativeMethodAccessorImpl.invoke0(Native Method)
              at sun.reflect.NativeMethodAccessorImpl.invoke(NativeMethodAccessorImpl.java:57)
              at sun.reflect.DelegatingMethodAccessorImpl.invoke(DelegatingMethodAccessorImpl.java:43)
              at java.lang.reflect.Method.invoke(Method.java:606)
              at org.testng.internal.MethodInvocationHelper.invokeMethod(MethodInvocationHelper.java:84)
              at org.testng.internal.Invoker.invokeMethod(Invoker.java:714)
              at org.testng.internal.Invoker.invokeTestMethod(Invoker.java:901)
              at org.testng.internal.Invoker.invokeTestMethods(Invoker.java:1231)
              at org.testng.internal.TestMethodWorker.invokeTestMethods(TestMethodWorker.java:127)
              at org.testng.internal.TestMethodWorker.run(TestMethodWorker.java:111)
              at org.testng.TestRunner.privateRun(TestRunner.java:767)
              at org.testng.TestRunner.run(TestRunner.java:617)
              at org.testng.SuiteRunner.runTest(SuiteRunner.java:348)
              at org.testng.SuiteRunner.access$000(SuiteRunner.java:38)
              at org.testng.SuiteRunner$SuiteWorker.run(SuiteRunner.java:382)
              at org.testng.internal.thread.ThreadUtil$2.call(ThreadUtil.java:64)
              at java.util.concurrent.FutureTask.run(FutureTask.java:262)
              at java.util.concurrent.ThreadPoolExecutor.runWorker(ThreadPoolExecutor.java:1145)
              at java.util.concurrent.ThreadPoolExecutor$Worker.run(ThreadPoolExecutor.java:615)
              at java.lang.Thread.run(Thread.java:745)
      

      Attachments

        Activity

          People

            dberinde@redhat.com dberinde@redhat.com
            gfernand@redhat.com gfernand@redhat.com
            Votes:
            0 Vote for this issue
            Watchers:
            4 Start watching this issue

            Dates

              Created:
              Updated:
              Resolved: