Uploaded image for project: 'Infinispan'
  1. Infinispan
  2. ISPN-10379

JCache tck-runner test failures are ignored in Jenkins

    XMLWordPrintable

Details

    Description

      This build has 0 failures in Jenkins, but the console log says otherwise:

      https://ci.infinispan.org/job/Infinispan/job/PR-7110/1/

      [2019-07-02T18:45:17.550Z] 18:45:16.738 [INFO] --- maven-failsafe-plugin:3.0.0-M3:integration-test (tck-embedded) @ infinispan-jcache-tck-runner ---
      [2019-07-02T18:45:17.550Z] 18:45:16.750 [INFO] Failsafe report directory: /home/infinispan/workspace/Infinispan_PR-7110/jcache/tck-runner/target/failsafe-reports-embedded
      ...
      [2019-07-02T18:45:53.348Z] 18:45:53.137 [ERROR]   CacheExpiryTest.invokeAllReadThroughEnabledGetOnNonExistentEntry:1202 
      [2019-07-02T18:45:53.348Z] Expected: is <0>
      [2019-07-02T18:45:53.348Z]      but: was <5>
      [2019-07-02T18:45:53.348Z] 18:45:53.137 [ERROR]   CacheExpiryTest.invokeGetValueWithReadThroughForNonExistentEntryShouldCallGetExpiryForCreatedEntry:1110 
      [2019-07-02T18:45:53.348Z] Expected: is <0>
      [2019-07-02T18:45:53.348Z]      but: was <1>
      [2019-07-02T18:45:53.348Z] 18:45:53.138 [ERROR]   CacheWriterTest.shouldWriteThoughUsingPutAll_partialSuccess:688 expected:<2> but was:<3>
      [2019-07-02T18:45:53.348Z] 18:45:53.138 [INFO] 
      [2019-07-02T18:45:53.348Z] 18:45:53.138 [ERROR] Tests run: 491, Failures: 3, Errors: 0, Skipped: 0
      

      Attachments

        Issue Links

          Activity

            People

              dberinde@redhat.com Dan Berindei
              dberinde@redhat.com Dan Berindei
              Votes:
              0 Vote for this issue
              Watchers:
              1 Start watching this issue

              Dates

                Created:
                Updated:
                Resolved: