Uploaded image for project: 'Infinispan'
  1. Infinispan
  2. ISPN-10233

Vendor-specific JAAS configuration fails when using -Pjava8-test with IBM J9

    Details

    • Type: Bug
    • Status: Closed (View Workflow)
    • Priority: Major
    • Resolution: Done
    • Affects Version/s: 10.0.0.Beta3, 9.4.13.Final
    • Fix Version/s: 10.0.0.Beta4
    • Component/s: None
    • Labels:
      None

      Description

      org.infinispan.server.test.client.hotrod.security.HotRodKrbAuthIT#testAdmin
      env=: udp-IbmJDK8-RHEL7

      ===Error:===
      java.lang.RuntimeException: Could not retrieve HotRod host
      	at org.infinispan.server.test.client.hotrod.security.HotRodKrbAuthIT.initAsAdmin(HotRodKrbAuthIT.java:74)
      Caused by: java.lang.IllegalArgumentException: Could not retrieve attribute HostName on MBean jboss.datagrid-infinispan:type=Server,name=HotRod,component=Transport
      	at org.infinispan.server.test.client.hotrod.security.HotRodKrbAuthIT.initAsAdmin(HotRodKrbAuthIT.java:74)
      Caused by: javax.management.InstanceNotFoundException: jboss.datagrid-infinispan:type=Server,name=HotRod,component=Transport
      
      ===System Out:===
      [31m[OK:    35, KO:    12, SKIP:     0] Test failed: HotRodKrbAuthIT.testAnonymous[0m
      java.lang.Exception: Unexpected exception, expected<org.infinispan.client.hotrod.exceptions.HotRodClientException> but was<java.lang.RuntimeException>
      	at org.junit.internal.runners.statements.ExpectException.evaluate(ExpectException.java:28)
      	at org.jboss.arquillian.junit.Arquillian$4.evaluate(Arquillian.java:246)
      	at org.jboss.arquillian.junit.Arquillian.multiExecute(Arquillian.java:431)
      	at org.jboss.arquillian.junit.Arquillian.access$200(Arquillian.java:55)
      	at org.jboss.arquillian.junit.Arquillian$5.evaluate(Arquillian.java:260)
      	at org.jboss.arquillian.junit.Arquillian$7$1.invoke(Arquillian.java:324)
      	at org.jboss.arquillian.container.test.impl.execution.ClientBeforeAfterLifecycleEventExecuter.execute(ClientBeforeAfterLifecycleEventExecuter.java:99)
      	at org.jboss.arquillian.container.test.impl.execution.ClientBeforeAfterLifecycleEventExecuter.on(ClientBeforeAfterLifecycleEventExecuter.java:72)
      	at sun.reflect.GeneratedMethodAccessor24.invoke(Unknown Source)
      	at sun.reflect.DelegatingMethodAccessorImpl.invoke(DelegatingMethodAccessorImpl.java:55)
      	at java.lang.reflect.Method.invoke(Method.java:508)
      	at org.jboss.arquillian.core.impl.ObserverImpl.invoke(ObserverImpl.java:96)
      	at org.jboss.arquillian.core.impl.EventContextImpl.invokeObservers(EventContextImpl.java:103)
      	at org.jboss.arquillian.core.impl.EventContextImpl.proceed(EventContextImpl.java:85)
      	at org.jboss.arquillian.container.test.impl.client.ContainerEventController.createContext(ContainerEventController.java:142)
      	at org.jboss.arquillian.container.test.impl.client.ContainerEventController.createBeforeContext(ContainerEventController.java:124)
      	at sun.reflect.GeneratedMethodAccessor23.invoke(Unknown Source)
      	at sun.reflect.DelegatingMethodAccessorImpl.invoke(DelegatingMethodAccessorImpl.java:55)
      	at java.lang.reflect.Method.invoke(Method.java:508)
      	at org.jboss.arquillian.core.impl.ObserverImpl.invoke(ObserverImpl.java:96)
      	at org.jboss.arquillian.core.impl.EventContextImpl.proceed(EventContextImpl.java:92)
      	at org.jboss.arquillian.test.impl.TestContextHandler.createTestContext(TestContextHandler.java:130)
      	at sun.reflect.GeneratedMethodAccessor22.invoke(Unknown Source)
      	at sun.reflect.DelegatingMethodAccessorImpl.invoke(DelegatingMethodAccessorImpl.java:55)
      	at java.lang.reflect.Method.invoke(Method.java:508)
      	at org.jboss.arquillian.core.impl.ObserverImpl.invoke(ObserverImpl.java:96)
      	at org.jboss.arquillian.core.impl.EventContextImpl.proceed(EventContextImpl.java:92)
      	at org.jboss.arquillian.test.impl.TestContextHandler.createClassContext(TestContextHandler.java:92)
      	at sun.reflect.GeneratedMethodAccessor18.invoke(Unknown Source)
      	at sun.reflect.DelegatingMethodAccessorImpl.invoke(DelegatingMethodAccessorImpl.java:55)
      	at java.lang.reflect.Method.invoke(Method.java:508)
      	at org.jboss.arquillian.core.impl.ObserverImpl.invoke(ObserverImpl.java:96)
      	at org.jboss.arquillian.core.impl.EventContextImpl.proceed(EventContextImpl.java:92)
      	at org.jboss.arquillian.test.impl.TestContextHandler.createSuiteContext(TestContextHandler.java:73)
      	at sun.reflect.GeneratedMethodAccessor17.invoke(Unknown Source)
      	at sun.reflect.DelegatingMethodAccessorImpl.invoke(DelegatingMethodAccessorImpl.java:55)
      	at java.lang.reflect.Method.invoke(Method.java:508)
      	at org.jboss.arquillian.core.impl.ObserverImpl.invoke(ObserverImpl.java:96)
      	at org.jboss.arquillian.core.impl.EventContextImpl.proceed(EventContextImpl.java:92)
      	at org.jboss.arquillian.core.impl.ManagerImpl.fire(ManagerImpl.java:143)
      	at org.jboss.arquillian.core.impl.ManagerImpl.fire(ManagerImpl.java:114)
      	at org.jboss.arquillian.test.impl.EventTestRunnerAdaptor.fireCustomLifecycle(EventTestRunnerAdaptor.java:159)
      	at org.jboss.arquillian.junit.Arquillian$7.evaluate(Arquillian.java:317)
      	at org.junit.runners.ParentRunner.runLeaf(ParentRunner.java:325)
      	at org.junit.runners.BlockJUnit4ClassRunner.runChild(BlockJUnit4ClassRunner.java:78)
      	at org.junit.runners.BlockJUnit4ClassRunner.runChild(BlockJUnit4ClassRunner.java:57)
      	at org.junit.runners.ParentRunner$3.run(ParentRunner.java:290)
      	at org.junit.runners.ParentRunner$1.schedule(ParentRunner.java:71)
      	at org.junit.runners.ParentRunner.runChildren(ParentRunner.java:288)
      	at org.junit.runners.ParentRunner.access$000(ParentRunner.java:58)
      	at org.junit.runners.ParentRunner$2.evaluate(ParentRunner.java:268)
      	at org.jboss.arquillian.junit.Arquillian$2.evaluate(Arquillian.java:205)
      	at org.jboss.arquillian.junit.Arquillian.multiExecute(Arquillian.java:431)
      	at org.jboss.arquillian.junit.Arquillian.access$200(Arquillian.java:55)
      	at org.jboss.arquillian.junit.Arquillian$3.evaluate(Arquillian.java:219)
      	at org.junit.runners.ParentRunner.run(ParentRunner.java:363)
      	at org.jboss.arquillian.junit.Arquillian.run(Arquillian.java:167)
      	at org.junit.runners.Suite.runChild(Suite.java:128)
      	at org.junit.runners.Suite.runChild(Suite.java:27)
      	at org.junit.runners.ParentRunner$3.run(ParentRunner.java:290)
      	at org.junit.runners.ParentRunner$1.schedule(ParentRunner.java:71)
      	at org.junit.runners.ParentRunner.runChildren(ParentRunner.java:288)
      	at org.junit.runners.ParentRunner.access$000(ParentRunner.java:58)
      	at org.junit.runners.ParentRunner$2.evaluate(ParentRunner.java:268)
      	at org.junit.runners.ParentRunner.run(ParentRunner.java:363)
      	at org.apache.maven.surefire.junitcore.JUnitCore.run(JUnitCore.java:55)
      	at org.apache.maven.surefire.junitcore.JUnitCoreWrapper.createRequestAndRun(JUnitCoreWrapper.java:137)
      	at org.apache.maven.surefire.junitcore.JUnitCoreWrapper.executeEager(JUnitCoreWrapper.java:107)
      	at org.apache.maven.surefire.junitcore.JUnitCoreWrapper.execute(JUnitCoreWrapper.java:83)
      	at org.apache.maven.surefire.junitcore.JUnitCoreWrapper.execute(JUnitCoreWrapper.java:75)
      	at org.apache.maven.surefire.junitcore.JUnitCoreProvider.invoke(JUnitCoreProvider.java:158)
      	at org.apache.maven.surefire.booter.ForkedBooter.invokeProviderInSameClassLoader(ForkedBooter.java:384)
      	at org.apache.maven.surefire.booter.ForkedBooter.runSuitesInProcess(ForkedBooter.java:345)
      	at org.apache.maven.surefire.booter.ForkedBooter.execute(ForkedBooter.java:126)
      	at org.apache.maven.surefire.booter.ForkedBooter.main(ForkedBooter.java:418)
      Caused by: java.lang.RuntimeException: Could not retrieve HotRod host
      	at org.infinispan.arquillian.core.HotRodEndpoint.getInetAddress(HotRodEndpoint.java:70)
      	at org.infinispan.server.test.client.hotrod.security.HotRodSaslAuthTestBase.initAsAnonymous(HotRodSaslAuthTestBase.java:69)
      	at org.infinispan.server.test.client.hotrod.security.HotRodSaslAuthTestBase.testAnonymous(HotRodSaslAuthTestBase.java:157)
      	at sun.reflect.NativeMethodAccessorImpl.invoke0(Native Method)
      	at sun.reflect.NativeMethodAccessorImpl.invoke(NativeMethodAccessorImpl.java:90)
      	at sun.reflect.DelegatingMethodAccessorImpl.invoke(DelegatingMethodAccessorImpl.java:55)
      	at java.lang.reflect.Method.invoke(Method.java:508)
      	at org.junit.runners.model.FrameworkMethod$1.runReflectiveCall(FrameworkMethod.java:50)
      	at org.junit.internal.runners.model.ReflectiveCallable.run(ReflectiveCallable.java:12)
      	at org.junit.runners.model.FrameworkMethod.invokeExplosively(FrameworkMethod.java:52)
      	at org.jboss.arquillian.junit.Arquillian$8$1.invoke(Arquillian.java:379)
      	at org.jboss.arquillian.container.test.impl.execution.LocalTestExecuter.execute(LocalTestExecuter.java:60)
      	at sun.reflect.GeneratedMethodAccessor36.invoke(Unknown Source)
      	at sun.reflect.DelegatingMethodAccessorImpl.invoke(DelegatingMethodAccessorImpl.java:55)
      	at java.lang.reflect.Method.invoke(Method.java:508)
      	at org.jboss.arquillian.core.impl.ObserverImpl.invoke(ObserverImpl.java:96)
      	at org.jboss.arquillian.core.impl.EventContextImpl.invokeObservers(EventContextImpl.java:103)
      	at org.jboss.arquillian.core.impl.EventContextImpl.proceed(EventContextImpl.java:85)
      	at org.jboss.arquillian.core.impl.ManagerImpl.fire(ManagerImpl.java:143)
      	at org.jboss.arquillian.core.impl.ManagerImpl.fire(ManagerImpl.java:114)
      	at org.jboss.arquillian.core.impl.EventImpl.fire(EventImpl.java:67)
      	at org.jboss.arquillian.container.test.impl.execution.ClientTestExecuter.execute(ClientTestExecuter.java:53)
      	at sun.reflect.GeneratedMethodAccessor35.invoke(Unknown Source)
      	at sun.reflect.DelegatingMethodAccessorImpl.invoke(DelegatingMethodAccessorImpl.java:55)
      	at java.lang.reflect.Method.invoke(Method.java:508)
      	at org.jboss.arquillian.core.impl.ObserverImpl.invoke(ObserverImpl.java:96)
      	at org.jboss.arquillian.core.impl.EventContextImpl.invokeObservers(EventContextImpl.java:103)
      	at org.jboss.arquillian.core.impl.EventContextImpl.proceed(EventContextImpl.java:85)
      	at org.jboss.arquillian.container.test.impl.client.ContainerEventController.createContext(ContainerEventController.java:142)
      	at org.jboss.arquillian.container.test.impl.client.ContainerEventController.createTestContext(ContainerEventController.java:129)
      	at sun.reflect.GeneratedMethodAccessor34.invoke(Unknown Source)
      	at sun.reflect.DelegatingMethodAccessorImpl.invoke(DelegatingMethodAccessorImpl.java:55)
      	at java.lang.reflect.Method.invoke(Method.java:508)
      	at org.jboss.arquillian.core.impl.ObserverImpl.invoke(ObserverImpl.java:96)
      	at org.jboss.arquillian.core.impl.EventContextImpl.proceed(EventContextImpl.java:92)
      	at org.jboss.arquillian.test.impl.TestContextHandler.createTestContext(TestContextHandler.java:130)
      	at sun.reflect.GeneratedMethodAccessor22.invoke(Unknown Source)
      	at sun.reflect.DelegatingMethodAccessorImpl.invoke(DelegatingMethodAccessorImpl.java:55)
      	at java.lang.reflect.Method.invoke(Method.java:508)
      	at org.jboss.arquillian.core.impl.ObserverImpl.invoke(ObserverImpl.java:96)
      	at org.jboss.arquillian.core.impl.EventContextImpl.proceed(EventContextImpl.java:92)
      	at org.jboss.arquillian.test.impl.TestContextHandler.createClassContext(TestContextHandler.java:92)
      	at sun.reflect.GeneratedMethodAccessor18.invoke(Unknown Source)
      	at sun.reflect.DelegatingMethodAccessorImpl.invoke(DelegatingMethodAccessorImpl.java:55)
      	at java.lang.reflect.Method.invoke(Method.java:508)
      	at org.jboss.arquillian.core.impl.ObserverImpl.invoke(ObserverImpl.java:96)
      	at org.jboss.arquillian.core.impl.EventContextImpl.proceed(EventContextImpl.java:92)
      	at org.jboss.arquillian.test.impl.TestContextHandler.createSuiteContext(TestContextHandler.java:73)
      	at sun.reflect.GeneratedMethodAccessor17.invoke(Unknown Source)
      	at sun.reflect.DelegatingMethodAccessorImpl.invoke(DelegatingMethodAccessorImpl.java:55)
      	at java.lang.reflect.Method.invoke(Method.java:508)
      	at org.jboss.arquillian.core.impl.ObserverImpl.invoke(ObserverImpl.java:96)
      	at org.jboss.arquillian.core.impl.EventContextImpl.proceed(EventContextImpl.java:92)
      	at org.jboss.arquillian.core.impl.ManagerImpl.fire(ManagerImpl.java:143)
      	at org.jboss.arquillian.test.impl.EventTestRunnerAdaptor.test(EventTestRunnerAdaptor.java:136)
      	at org.jboss.arquillian.junit.Arquillian$8.evaluate(Arquillian.java:372)
      	at org.junit.internal.runners.statements.ExpectException.evaluate(ExpectException.java:19)
      	... 74 more
      Caused by: java.lang.IllegalArgumentException: Could not retrieve attribute HostName on MBean jboss.datagrid-infinispan:type=Server,name=HotRod,component=Transport
      	at org.infinispan.arquillian.utils.MBeanUtils.getMBeanAttribute(MBeanUtils.java:59)
      	at org.infinispan.arquillian.core.HotRodEndpoint.getInetAddress(HotRodEndpoint.java:65)
      	... 130 more
      Caused by: javax.management.InstanceNotFoundException: jboss.datagrid-infinispan:type=Server,name=HotRod,component=Transport
      	at org.jboss.as.jmx.PluggableMBeanServerImpl.findDelegate(PluggableMBeanServerImpl.java:1110)
      	at org.jboss.as.jmx.PluggableMBeanServerImpl.getAttribute(PluggableMBeanServerImpl.java:386)
      	at org.jboss.as.jmx.BlockingNotificationMBeanServer.getAttribute(BlockingNotificationMBeanServer.java:148)
      	at org.jboss.as.jmx.AuthorizingMBeanServer.getAttribute(AuthorizingMBeanServer.java:210)
      	at org.jboss.remotingjmx.protocol.v2.ServerProxy$GetAttributeHandler.handle(ServerProxy.java:689)
      	at org.jboss.remotingjmx.protocol.v2.ServerCommon$MessageReciever$1$1.run(ServerCommon.java:153)
      	at org.jboss.as.jmx.ServerInterceptorFactory$Interceptor$1.run(ServerInterceptorFactory.java:71)
      	at org.jboss.as.jmx.ServerInterceptorFactory$Interceptor$1.run(ServerInterceptorFactory.java:66)
      	at org.wildfly.security.auth.server.SecurityIdentity$$Lambda$487.000000003C034110.run(Unknown Source)
      	at org.wildfly.security.auth.server.SecurityIdentity.runAs(SecurityIdentity.java:289)
      	at org.wildfly.security.auth.server.SecurityIdentity.runAs(SecurityIdentity.java:246)
      	at org.jboss.as.controller.AccessAuditContext.doAs(AccessAuditContext.java:254)
      	at org.jboss.as.controller.AccessAuditContext.doAs(AccessAuditContext.java:225)
      	at org.jboss.as.jmx.ServerInterceptorFactory$Interceptor.handleEvent(ServerInterceptorFactory.java:66)
      	at org.jboss.remotingjmx.protocol.v2.ServerCommon$MessageReciever$1.run(ServerCommon.java:149)
      	at java.util.concurrent.ThreadPoolExecutor.runWorker(ThreadPoolExecutor.java:1160)
      	at java.util.concurrent.ThreadPoolExecutor$Worker.run(ThreadPoolExecutor.java:635)
      	at java.lang.Thread.run(Thread.java:812)
      22:12:15.440 [main] ERROR org.infinispan.commons.test.TestSuiteProgress - Test failed: HotRodKrbAuthIT.testAnonymous
      java.lang.Exception: Unexpected exception, expected<org.infinispan.client.hotrod.exceptions.HotRodClientException> but was<java.lang.RuntimeException>
      	at org.junit.internal.runners.statements.ExpectException.evaluate(ExpectException.java:28) ~[?:?]
      	at org.jboss.arquillian.junit.Arquillian$4.evaluate(Arquillian.java:246) ~[?:?]
      	at org.jboss.arquillian.junit.Arquillian.multiExecute(Arquillian.java:431) ~[?:?]
      	at org.jboss.arquillian.junit.Arquillian.access$200(Arquillian.java:55) ~[?:?]
      	at org.jboss.arquillian.junit.Arquillian$5.evaluate(Arquillian.java:260) ~[?:?]
      	at org.jboss.arquillian.junit.Arquillian$7$1.invoke(Arquillian.java:324) ~[?:?]
      	at org.jboss.arquillian.container.test.impl.execution.ClientBeforeAfterLifecycleEventExecuter.execute(ClientBeforeAfterLifecycleEventExecuter.java:99) ~[?:?]
      	at org.jboss.arquillian.container.test.impl.execution.ClientBeforeAfterLifecycleEventExecuter.on(ClientBeforeAfterLifecycleEventExecuter.java:72) ~[?:?]
      	at sun.reflect.GeneratedMethodAccessor24.invoke(Unknown Source) ~[?:?]
      	at sun.reflect.DelegatingMethodAccessorImpl.invoke(DelegatingMethodAccessorImpl.java:55) ~[?:?]
      	at java.lang.reflect.Method.invoke(Method.java:508) ~[?:?]
      	at org.jboss.arquillian.core.impl.ObserverImpl.invoke(ObserverImpl.java:96) ~[?:?]
      	at org.jboss.arquillian.core.impl.EventContextImpl.invokeObservers(EventContextImpl.java:103) ~[?:?]
      	at org.jboss.arquillian.core.impl.EventContextImpl.proceed(EventContextImpl.java:85) ~[?:?]
      	at org.jboss.arquillian.container.test.impl.client.ContainerEventController.createContext(ContainerEventController.java:142) ~[?:?]
      	at org.jboss.arquillian.container.test.impl.client.ContainerEventController.createBeforeContext(ContainerEventController.java:124) ~[?:?]
      	at sun.reflect.GeneratedMethodAccessor23.invoke(Unknown Source) ~[?:?]
      	at sun.reflect.DelegatingMethodAccessorImpl.invoke(DelegatingMethodAccessorImpl.java:55) ~[?:?]
      	at java.lang.reflect.Method.invoke(Method.java:508) ~[?:?]
      	at org.jboss.arquillian.core.impl.ObserverImpl.invoke(ObserverImpl.java:96) ~[?:?]
      	at org.jboss.arquillian.core.impl.EventContextImpl.proceed(EventContextImpl.java:92) ~[?:?]
      	at org.jboss.arquillian.test.impl.TestContextHandler.createTestContext(TestContextHandler.java:130) ~[?:?]
      	at sun.reflect.GeneratedMethodAccessor22.invoke(Unknown Source) ~[?:?]
      	at sun.reflect.DelegatingMethodAccessorImpl.invoke(DelegatingMethodAccessorImpl.java:55) ~[?:?]
      	at java.lang.reflect.Method.invoke(Method.java:508) ~[?:?]
      	at org.jboss.arquillian.core.impl.ObserverImpl.invoke(ObserverImpl.java:96) ~[?:?]
      	at org.jboss.arquillian.core.impl.EventContextImpl.proceed(EventContextImpl.java:92) ~[?:?]
      	at org.jboss.arquillian.test.impl.TestContextHandler.createClassContext(TestContextHandler.java:92) ~[?:?]
      	at sun.reflect.GeneratedMethodAccessor18.invoke(Unknown Source) ~[?:?]
      	at sun.reflect.DelegatingMethodAccessorImpl.invoke(DelegatingMethodAccessorImpl.java:55) ~[?:?]
      	at java.lang.reflect.Method.invoke(Method.java:508) ~[?:?]
      	at org.jboss.arquillian.core.impl.ObserverImpl.invoke(ObserverImpl.java:96) ~[?:?]
      	at org.jboss.arquillian.core.impl.EventContextImpl.proceed(EventContextImpl.java:92) ~[?:?]
      	at org.jboss.arquillian.test.impl.TestContextHandler.createSuiteContext(TestContextHandler.java:73) ~[?:?]
      	at sun.reflect.GeneratedMethodAccessor17.invoke(Unknown Source) ~[?:?]
      	at sun.reflect.DelegatingMethodAccessorImpl.invoke(DelegatingMethodAccessorImpl.java:55) ~[?:?]
      	at java.lang.reflect.Method.invoke(Method.java:508) ~[?:?]
      	at org.jboss.arquillian.core.impl.ObserverImpl.invoke(ObserverImpl.java:96) ~[?:?]
      	at org.jboss.arquillian.core.impl.EventContextImpl.proceed(EventContextImpl.java:92) ~[?:?]
      	at org.jboss.arquillian.core.impl.ManagerImpl.fire(ManagerImpl.java:143) ~[?:?]
      	at org.jboss.arquillian.core.impl.ManagerImpl.fire(ManagerImpl.java:114) ~[?:?]
      	at org.jboss.arquillian.test.impl.EventTestRunnerAdaptor.fireCustomLifecycle(EventTestRunnerAdaptor.java:159) ~[?:?]
      	at org.jboss.arquillian.junit.Arquillian$7.evaluate(Arquillian.java:317) ~[?:?]
      	at org.junit.runners.ParentRunner.runLeaf(ParentRunner.java:325) [?:?]
      	at org.junit.runners.BlockJUnit4ClassRunner.runChild(BlockJUnit4ClassRunner.java:78) [?:?]
      	at org.junit.runners.BlockJUnit4ClassRunner.runChild(BlockJUnit4ClassRunner.java:57) [?:?]
      	at org.junit.runners.ParentRunner$3.run(ParentRunner.java:290) [?:?]
      	at org.junit.runners.ParentRunner$1.schedule(ParentRunner.java:71) [?:?]
      	at org.junit.runners.ParentRunner.runChildren(ParentRunner.java:288) [?:?]
      	at org.junit.runners.ParentRunner.access$000(ParentRunner.java:58) [?:?]
      	at org.junit.runners.ParentRunner$2.evaluate(ParentRunner.java:268) [?:?]
      	at org.jboss.arquillian.junit.Arquillian$2.evaluate(Arquillian.java:205) [?:?]
      	at org.jboss.arquillian.junit.Arquillian.multiExecute(Arquillian.java:431) [?:?]
      	at org.jboss.arquillian.junit.Arquillian.access$200(Arquillian.java:55) [?:?]
      	at org.jboss.arquillian.junit.Arquillian$3.evaluate(Arquillian.java:219) [?:?]
      	at org.junit.runners.ParentRunner.run(ParentRunner.java:363) [?:?]
      	at org.jboss.arquillian.junit.Arquillian.run(Arquillian.java:167) [?:?]
      	at org.junit.runners.Suite.runChild(Suite.java:128) [?:?]
      	at org.junit.runners.Suite.runChild(Suite.java:27) [?:?]
      	at org.junit.runners.ParentRunner$3.run(ParentRunner.java:290) [?:?]
      	at org.junit.runners.ParentRunner$1.schedule(ParentRunner.java:71) [?:?]
      	at org.junit.runners.ParentRunner.runChildren(ParentRunner.java:288) [?:?]
      	at org.junit.runners.ParentRunner.access$000(ParentRunner.java:58) [?:?]
      	at org.junit.runners.ParentRunner$2.evaluate(ParentRunner.java:268) [?:?]
      	at org.junit.runners.ParentRunner.run(ParentRunner.java:363) [?:?]
      	at org.apache.maven.surefire.junitcore.JUnitCore.run(JUnitCore.java:55) [?:?]
      	at org.apache.maven.surefire.junitcore.JUnitCoreWrapper.createRequestAndRun(JUnitCoreWrapper.java:137) [?:?]
      	at org.apache.maven.surefire.junitcore.JUnitCoreWrapper.executeEager(JUnitCoreWrapper.java:107) [?:?]
      	at org.apache.maven.surefire.junitcore.JUnitCoreWrapper.execute(JUnitCoreWrapper.java:83) [?:?]
      	at org.apache.maven.surefire.junitcore.JUnitCoreWrapper.execute(JUnitCoreWrapper.java:75) [?:?]
      	at org.apache.maven.surefire.junitcore.JUnitCoreProvider.invoke(JUnitCoreProvider.java:158) [?:?]
      	at org.apache.maven.surefire.booter.ForkedBooter.invokeProviderInSameClassLoader(ForkedBooter.java:384) [?:?]
      	at org.apache.maven.surefire.booter.ForkedBooter.runSuitesInProcess(ForkedBooter.java:345) [?:?]
      	at org.apache.maven.surefire.booter.ForkedBooter.execute(ForkedBooter.java:126) [?:?]
      	at org.apache.maven.surefire.booter.ForkedBooter.main(ForkedBooter.java:418) [?:?]
      Caused by: java.lang.RuntimeException: Could not retrieve HotRod host
      	at org.infinispan.arquillian.core.HotRodEndpoint.getInetAddress(HotRodEndpoint.java:70) ~[?:?]
      	at org.infinispan.server.test.client.hotrod.security.HotRodSaslAuthTestBase.initAsAnonymous(HotRodSaslAuthTestBase.java:69) ~[?:?]
      	at org.infinispan.server.test.client.hotrod.security.HotRodSaslAuthTestBase.testAnonymous(HotRodSaslAuthTestBase.java:157) ~[?:?]
      	at sun.reflect.NativeMethodAccessorImpl.invoke0(Native Method) ~[?:?]
      	at sun.reflect.NativeMethodAccessorImpl.invoke(NativeMethodAccessorImpl.java:90) ~[?:?]
      	at sun.reflect.DelegatingMethodAccessorImpl.invoke(DelegatingMethodAccessorImpl.java:55) ~[?:?]
      	at java.lang.reflect.Method.invoke(Method.java:508) ~[?:?]
      	at org.junit.runners.model.FrameworkMethod$1.runReflectiveCall(FrameworkMethod.java:50) ~[?:?]
      	at org.junit.internal.runners.model.ReflectiveCallable.run(ReflectiveCallable.java:12) ~[?:?]
      	at org.junit.runners.model.FrameworkMethod.invokeExplosively(FrameworkMethod.java:52) ~[?:?]
      	at org.jboss.arquillian.junit.Arquillian$8$1.invoke(Arquillian.java:379) ~[?:?]
      	at org.jboss.arquillian.container.test.impl.execution.LocalTestExecuter.execute(LocalTestExecuter.java:60) ~[?:?]
      	at sun.reflect.GeneratedMethodAccessor36.invoke(Unknown Source) ~[?:?]
      	at sun.reflect.DelegatingMethodAccessorImpl.invoke(DelegatingMethodAccessorImpl.java:55) ~[?:?]
      	at java.lang.reflect.Method.invoke(Method.java:508) ~[?:?]
      	at org.jboss.arquillian.core.impl.ObserverImpl.invoke(ObserverImpl.java:96) ~[?:?]
      	at org.jboss.arquillian.core.impl.EventContextImpl.invokeObservers(EventContextImpl.java:103) ~[?:?]
      	at org.jboss.arquillian.core.impl.EventContextImpl.proceed(EventContextImpl.java:85) ~[?:?]
      	at org.jboss.arquillian.core.impl.ManagerImpl.fire(ManagerImpl.java:143) ~[?:?]
      	at org.jboss.arquillian.core.impl.ManagerImpl.fire(ManagerImpl.java:114) ~[?:?]
      	at org.jboss.arquillian.core.impl.EventImpl.fire(EventImpl.java:67) ~[?:?]
      	at org.jboss.arquillian.container.test.impl.execution.ClientTestExecuter.execute(ClientTestExecuter.java:53) ~[?:?]
      	at sun.reflect.GeneratedMethodAccessor35.invoke(Unknown Source) ~[?:?]
      	at sun.reflect.DelegatingMethodAccessorImpl.invoke(DelegatingMethodAccessorImpl.java:55) ~[?:?]
      	at java.lang.reflect.Method.invoke(Method.java:508) ~[?:?]
      	at org.jboss.arquillian.core.impl.ObserverImpl.invoke(ObserverImpl.java:96) ~[?:?]
      	at org.jboss.arquillian.core.impl.EventContextImpl.invokeObservers(EventContextImpl.java:103) ~[?:?]
      	at org.jboss.arquillian.core.impl.EventContextImpl.proceed(EventContextImpl.java:85) ~[?:?]
      	at org.jboss.arquillian.container.test.impl.client.ContainerEventController.createContext(ContainerEventController.java:142) ~[?:?]
      	at org.jboss.arquillian.container.test.impl.client.ContainerEventController.createTestContext(ContainerEventController.java:129) ~[?:?]
      	at sun.reflect.GeneratedMethodAccessor34.invoke(Unknown Source) ~[?:?]
      	at sun.reflect.DelegatingMethodAccessorImpl.invoke(DelegatingMethodAccessorImpl.java:55) ~[?:?]
      	at java.lang.reflect.Method.invoke(Method.java:508) ~[?:?]
      	at org.jboss.arquillian.core.impl.ObserverImpl.invoke(ObserverImpl.java:96) ~[?:?]
      	at org.jboss.arquillian.core.impl.EventContextImpl.proceed(EventContextImpl.java:92) ~[?:?]
      	at org.jboss.arquillian.test.impl.TestContextHandler.createTestContext(TestContextHandler.java:130) ~[?:?]
      	at sun.reflect.GeneratedMethodAccessor22.invoke(Unknown Source) ~[?:?]
      	at sun.reflect.DelegatingMethodAccessorImpl.invoke(DelegatingMethodAccessorImpl.java:55) ~[?:?]
      	at java.lang.reflect.Method.invoke(Method.java:508) ~[?:?]
      	at org.jboss.arquillian.core.impl.ObserverImpl.invoke(ObserverImpl.java:96) ~[?:?]
      	at org.jboss.arquillian.core.impl.EventContextImpl.proceed(EventContextImpl.java:92) ~[?:?]
      	at org.jboss.arquillian.test.impl.TestContextHandler.createClassContext(TestContextHandler.java:92) ~[?:?]
      	at sun.reflect.GeneratedMethodAccessor18.invoke(Unknown Source) ~[?:?]
      	at sun.reflect.DelegatingMethodAccessorImpl.invoke(DelegatingMethodAccessorImpl.java:55) ~[?:?]
      	at java.lang.reflect.Method.invoke(Method.java:508) ~[?:?]
      	at org.jboss.arquillian.core.impl.ObserverImpl.invoke(ObserverImpl.java:96) ~[?:?]
      	at org.jboss.arquillian.core.impl.EventContextImpl.proceed(EventContextImpl.java:92) ~[?:?]
      	at org.jboss.arquillian.test.impl.TestContextHandler.createSuiteContext(TestContextHandler.java:73) ~[?:?]
      	at sun.reflect.GeneratedMethodAccessor17.invoke(Unknown Source) ~[?:?]
      	at sun.reflect.DelegatingMethodAccessorImpl.invoke(DelegatingMethodAccessorImpl.java:55) ~[?:?]
      	at java.lang.reflect.Method.invoke(Method.java:508) ~[?:?]
      	at org.jboss.arquillian.core.impl.ObserverImpl.invoke(ObserverImpl.java:96) ~[?:?]
      	at org.jboss.arquillian.core.impl.EventContextImpl.proceed(EventContextImpl.java:92) ~[?:?]
      	at org.jboss.arquillian.core.impl.ManagerImpl.fire(ManagerImpl.java:143) ~[?:?]
      	at org.jboss.arquillian.test.impl.EventTestRunnerAdaptor.test(EventTestRunnerAdaptor.java:136) ~[?:?]
      	at org.jboss.arquillian.junit.Arquillian$8.evaluate(Arquillian.java:372) ~[?:?]
      	at org.junit.internal.runners.statements.ExpectException.evaluate(ExpectException.java:19) ~[?:?]
      	... 74 more
      Caused by: java.lang.IllegalArgumentException: Could not retrieve attribute HostName on MBean jboss.datagrid-infinispan:type=Server,name=HotRod,component=Transport
      	at org.infinispan.arquillian.utils.MBeanUtils.getMBeanAttribute(MBeanUtils.java:59) ~[?:?]
      	at org.infinispan.arquillian.core.HotRodEndpoint.getInetAddress(HotRodEndpoint.java:65) ~[?:?]
      	at org.infinispan.server.test.client.hotrod.security.HotRodSaslAuthTestBase.initAsAnonymous(HotRodSaslAuthTestBase.java:69) ~[?:?]
      	at org.infinispan.server.test.client.hotrod.security.HotRodSaslAuthTestBase.testAnonymous(HotRodSaslAuthTestBase.java:157) ~[?:?]
      	at sun.reflect.NativeMethodAccessorImpl.invoke0(Native Method) ~[?:?]
      	at sun.reflect.NativeMethodAccessorImpl.invoke(NativeMethodAccessorImpl.java:90) ~[?:?]
      	at sun.reflect.DelegatingMethodAccessorImpl.invoke(DelegatingMethodAccessorImpl.java:55) ~[?:?]
      	at java.lang.reflect.Method.invoke(Method.java:508) ~[?:?]
      	at org.junit.runners.model.FrameworkMethod$1.runReflectiveCall(FrameworkMethod.java:50) ~[?:?]
      	at org.junit.internal.runners.model.ReflectiveCallable.run(ReflectiveCallable.java:12) ~[?:?]
      	at org.junit.runners.model.FrameworkMethod.invokeExplosively(FrameworkMethod.java:52) ~[?:?]
      	at org.jboss.arquillian.junit.Arquillian$8$1.invoke(Arquillian.java:379) ~[?:?]
      	at org.jboss.arquillian.container.test.impl.execution.LocalTestExecuter.execute(LocalTestExecuter.java:60) ~[?:?]
      	at sun.reflect.GeneratedMethodAccessor36.invoke(Unknown Source) ~[?:?]
      	at sun.reflect.DelegatingMethodAccessorImpl.invoke(DelegatingMethodAccessorImpl.java:55) ~[?:?]
      	at java.lang.reflect.Method.invoke(Method.java:508) ~[?:?]
      	at org.jboss.arquillian.core.impl.ObserverImpl.invoke(ObserverImpl.java:96) ~[?:?]
      	at org.jboss.arquillian.core.impl.EventContextImpl.invokeObservers(EventContextImpl.java:103) ~[?:?]
      	at org.jboss.arquillian.core.impl.EventContextImpl.proceed(EventContextImpl.java:85) ~[?:?]
      	at org.jboss.arquillian.core.impl.ManagerImpl.fire(ManagerImpl.java:143) ~[?:?]
      	at org.jboss.arquillian.core.impl.ManagerImpl.fire(ManagerImpl.java:114) ~[?:?]
      	at org.jboss.arquillian.core.impl.EventImpl.fire(EventImpl.java:67) ~[?:?]
      	at org.jboss.arquillian.container.test.impl.execution.ClientTestExecuter.execute(ClientTestExecuter.java:53) ~[?:?]
      	at sun.reflect.GeneratedMethodAccessor35.invoke(Unknown Source) ~[?:?]
      	at sun.reflect.DelegatingMethodAccessorImpl.invoke(DelegatingMethodAccessorImpl.java:55) ~[?:?]
      	at java.lang.reflect.Method.invoke(Method.java:508) ~[?:?]
      	at org.jboss.arquillian.core.impl.ObserverImpl.invoke(ObserverImpl.java:96) ~[?:?]
      	at org.jboss.arquillian.core.impl.EventContextImpl.invokeObservers(EventContextImpl.java:103) ~[?:?]
      	at org.jboss.arquillian.core.impl.EventContextImpl.proceed(EventContextImpl.java:85) ~[?:?]
      	at org.jboss.arquillian.container.test.impl.client.ContainerEventController.createContext(ContainerEventController.java:142) ~[?:?]
      	at org.jboss.arquillian.container.test.impl.client.ContainerEventController.createTestContext(ContainerEventController.java:129) ~[?:?]
      	at sun.reflect.GeneratedMethodAccessor34.invoke(Unknown Source) ~[?:?]
      	at sun.reflect.DelegatingMethodAccessorImpl.invoke(DelegatingMethodAccessorImpl.java:55) ~[?:?]
      	at java.lang.reflect.Method.invoke(Method.java:508) ~[?:?]
      	at org.jboss.arquillian.core.impl.ObserverImpl.invoke(ObserverImpl.java:96) ~[?:?]
      	at org.jboss.arquillian.core.impl.EventContextImpl.proceed(EventContextImpl.java:92) ~[?:?]
      	at org.jboss.arquillian.test.impl.TestContextHandler.createTestContext(TestContextHandler.java:130) ~[?:?]
      	at sun.reflect.GeneratedMethodAccessor22.invoke(Unknown Source) ~[?:?]
      	at sun.reflect.DelegatingMethodAccessorImpl.invoke(DelegatingMethodAccessorImpl.java:55) ~[?:?]
      	at java.lang.reflect.Method.invoke(Method.java:508) ~[?:?]
      	at org.jboss.arquillian.core.impl.ObserverImpl.invoke(ObserverImpl.java:96) ~[?:?]
      	at org.jboss.arquillian.core.impl.EventContextImpl.proceed(EventContextImpl.java:92) ~[?:?]
      	at org.jboss.arquillian.test.impl.TestContextHandler.createClassContext(TestContextHandler.java:92) ~[?:?]
      	at sun.reflect.GeneratedMethodAccessor18.invoke(Unknown Source) ~[?:?]
      	at sun.reflect.DelegatingMethodAccessorImpl.invoke(DelegatingMethodAccessorImpl.java:55) ~[?:?]
      	at java.lang.reflect.Method.invoke(Method.java:508) ~[?:?]
      	at org.jboss.arquillian.core.impl.ObserverImpl.invoke(ObserverImpl.java:96) ~[?:?]
      	at org.jboss.arquillian.core.impl.EventContextImpl.proceed(EventContextImpl.java:92) ~[?:?]
      	at org.jboss.arquillian.test.impl.TestContextHandler.createSuiteContext(TestContextHandler.java:73) ~[?:?]
      	at sun.reflect.GeneratedMethodAccessor17.invoke(Unknown Source) ~[?:?]
      	at sun.reflect.DelegatingMethodAccessorImpl.invoke(DelegatingMethodAccessorImpl.java:55) ~[?:?]
      	at java.lang.reflect.Method.invoke(Method.java:508) ~[?:?]
      	at org.jboss.arquillian.core.impl.ObserverImpl.invoke(ObserverImpl.java:96) ~[?:?]
      	at org.jboss.arquillian.core.impl.EventContextImpl.proceed(EventContextImpl.java:92) ~[?:?]
      	at org.jboss.arquillian.core.impl.ManagerImpl.fire(ManagerImpl.java:143) ~[?:?]
      	at org.jboss.arquillian.test.impl.EventTestRunnerAdaptor.test(EventTestRunnerAdaptor.java:136) ~[?:?]
      	at org.jboss.arquillian.junit.Arquillian$8.evaluate(Arquillian.java:372) ~[?:?]
      	at org.junit.internal.runners.statements.ExpectException.evaluate(ExpectException.java:19) ~[?:?]
      	... 74 more
      Caused by: javax.management.InstanceNotFoundException: jboss.datagrid-infinispan:type=Server,name=HotRod,component=Transport
      	at org.jboss.as.jmx.PluggableMBeanServerImpl.findDelegate(PluggableMBeanServerImpl.java:1110) ~[?:?]
      	at org.jboss.as.jmx.PluggableMBeanServerImpl.getAttribute(PluggableMBeanServerImpl.java:386) ~[?:?]
      	at org.jboss.as.jmx.BlockingNotificationMBeanServer.getAttribute(BlockingNotificationMBeanServer.java:148) ~[?:?]
      	at org.jboss.as.jmx.AuthorizingMBeanServer.getAttribute(AuthorizingMBeanServer.java:210) ~[?:?]
      	at org.jboss.remotingjmx.protocol.v2.ServerProxy$GetAttributeHandler.handle(ServerProxy.java:689) ~[?:?]
      	at org.jboss.remotingjmx.protocol.v2.ServerCommon$MessageReciever$1$1.run(ServerCommon.java:153) ~[?:?]
      	at org.jboss.as.jmx.ServerInterceptorFactory$Interceptor$1.run(ServerInterceptorFactory.java:71) ~[?:?]
      	at org.jboss.as.jmx.ServerInterceptorFactory$Interceptor$1.run(ServerInterceptorFactory.java:66) ~[?:?]
      	at org.wildfly.security.auth.server.SecurityIdentity$$Lambda$487.000000003C034110.run(Unknown Source) ~[?:?]
      	at org.wildfly.security.auth.server.SecurityIdentity.runAs(SecurityIdentity.java:289) ~[?:?]
      	at org.wildfly.security.auth.server.SecurityIdentity.runAs(SecurityIdentity.java:246) ~[?:?]
      	at org.jboss.as.controller.AccessAuditContext.doAs(AccessAuditContext.java:254) ~[?:?]
      	at org.jboss.as.controller.AccessAuditContext.doAs(AccessAuditContext.java:225) ~[?:?]
      	at org.jboss.as.jmx.ServerInterceptorFactory$Interceptor.handleEvent(ServerInterceptorFactory.java:66) ~[?:?]
      	at org.jboss.remotingjmx.protocol.v2.ServerCommon$MessageReciever$1.run(ServerCommon.java:149) ~[?:?]
      	at java.util.concurrent.ThreadPoolExecutor.runWorker(ThreadPoolExecutor.java:1160) ~[?:?]
      	at java.util.concurrent.ThreadPoolExecutor$Worker.run(ThreadPoolExecutor.java:635) ~[?:?]
      	at java.lang.Thread.run(Thread.java:812) ~[?:?]
      [OK:    35, KO:    12, SKIP:     0] Test starting: HotRodKrbAuthIT.testAdmin
      [JGSS_DBG_CRED]  main JAAS config: debug=true
      [JGSS_DBG_CRED]  main JAAS config: credsType=initiate only (default)
      [JGSS_DBG_CRED]  main config: useDefaultCcache=false
      [JGSS_DBG_CRED]  main config: useCcache=null
      [JGSS_DBG_CRED]  main config: useDefaultKeytab=false (default)
      [JGSS_DBG_CRED]  main config: useKeytab=null
      [JGSS_DBG_CRED]  main JAAS config: forwardable=false
      [JGSS_DBG_CRED]  main JAAS config: renewable=false
      [JGSS_DBG_CRED]  main JAAS config: proxiable=false
      [JGSS_DBG_CRED]  main JAAS config: tryFirstPass=false (default)
      [JGSS_DBG_CRED]  main JAAS config: useFirstPass=false (default)
      [JGSS_DBG_CRED]  main JAAS config: moduleBanner=false (default)
      [JGSS_DBG_CRED]  main JAAS config: interactive login? yes
      [JGSS_DBG_CRED]  main JAAS config: refreshKrb5Config = true
      [JGSS_DBG_CRED]  main Retrieving Kerberos creds from cache for principal=null
      [JGSS_DBG_CRED]  main No Kerberos creds in cache for principal admin@INFINISPAN.ORG
      [JGSS_DBG_CRED]  main Doing Kerberos login for principal admin@INFINISPAN.ORG
      [JGSS_DBG_CRED]  main Doing Kerberos login for principal: admin@INFINISPAN.ORG
      22:12:15.474 [NioDatagramAcceptor-4] ERROR org.apache.directory.server.KERBEROS_LOG - No timestamp found
      [JGSS_DBG_CRED]  main Kerberos login complete
      [JGSS_DBG_CRED]  main Login successful
      [JGSS_DBG_CRED]  main kprincipal : admin@INFINISPAN.ORG
      [JGSS_DBG_CRED]  main admin@INFINISPAN.ORG added to Subject
      [JGSS_DBG_CRED]  main Kerberos ticket added to Subject
      [JGSS_DBG_CRED]  main added key of type aes128-cts-hmac-sha1-96 
      [JGSS_DBG_CRED]  main KerberosTicket is removed from subject
      [JGSS_DBG_CRED]  main KerberosKey Kerberos Principal admin@INFINISPAN.ORGKey Version 0key EncryptionKey: keyType=17 keyBytes (hex dump)=
      0000: 1f e7 f4 3e 90 38 ab 1f  bd 9b 78 e6 b3 62 b7 2a  .....8....x..b..
      
       is removed from subject
      [JGSS_DBG_CRED]  main JAAS config: debug=true
      [JGSS_DBG_CRED]  main JAAS config: credsType=initiate only (default)
      [JGSS_DBG_CRED]  main config: useDefaultCcache=false
      [JGSS_DBG_CRED]  main config: useCcache=null
      [JGSS_DBG_CRED]  main config: useDefaultKeytab=false (default)
      [JGSS_DBG_CRED]  main config: useKeytab=null
      [JGSS_DBG_CRED]  main JAAS config: forwardable=false
      [JGSS_DBG_CRED]  main JAAS config: renewable=false
      [JGSS_DBG_CRED]  main JAAS config: proxiable=false
      [JGSS_DBG_CRED]  main JAAS config: tryFirstPass=false (default)
      [JGSS_DBG_CRED]  main JAAS config: useFirstPass=false (default)
      [JGSS_DBG_CRED]  main JAAS config: moduleBanner=false (default)
      [JGSS_DBG_CRED]  main JAAS config: interactive login? yes
      [JGSS_DBG_CRED]  main JAAS config: refreshKrb5Config = true
      [JGSS_DBG_CRED]  main Retrieving Kerberos creds from cache for principal=null
      [JGSS_DBG_CRED]  main No Kerberos creds in cache for principal admin@INFINISPAN.ORG
      [JGSS_DBG_CRED]  main Doing Kerberos login for principal admin@INFINISPAN.ORG
      [JGSS_DBG_CRED]  main Doing Kerberos login for principal: admin@INFINISPAN.ORG
      22:12:15.506 [NioDatagramAcceptor-4] ERROR org.apache.directory.server.KERBEROS_LOG - No timestamp found
      [JGSS_DBG_CRED]  main Kerberos login complete
      [JGSS_DBG_CRED]  main Login successful
      [JGSS_DBG_CRED]  main kprincipal : admin@INFINISPAN.ORG
      [JGSS_DBG_CRED]  main admin@INFINISPAN.ORG added to Subject
      [JGSS_DBG_CRED]  main Kerberos ticket added to Subject
      [JGSS_DBG_CRED]  main added key of type aes128-cts-hmac-sha1-96
      
      

      org.infinispan.server.test.client.hotrod.security.HotRodKrbAuthIT#testReader
      env=: udp-IbmJDK8-RHEL7

      org.infinispan.server.test.client.hotrod.security.HotRodKrbAuthIT#testWriter
      env=: udp-IbmJDK8-RHEL7

      org.infinispan.server.test.client.hotrod.security.HotRodKrbAuthIT#testSupervisor
      env=: udp-IbmJDK8-RHEL7

      org.infinispan.server.test.client.hotrod.security.HotRodKrbAuthLdapAuthzIT#testAdmin
      env=: udp-IbmJDK8-RHEL7

      org.infinispan.server.test.client.hotrod.security.HotRodKrbAuthLdapAuthzIT#testReader
      env=: udp-IbmJDK8-RHEL7

      org.infinispan.server.test.client.hotrod.security.HotRodKrbAuthLdapAuthzIT#testWriter
      env=: udp-IbmJDK8-RHEL7

      org.infinispan.server.test.client.hotrod.security.HotRodKrbAuthLdapAuthzIT#testSupervisor
      env=: udp-IbmJDK8-RHEL7

      org.infinispan.server.test.client.hotrod.security.HotRodPlainAuthLdapOverSslIT#testAdmin
      env=: udp-IbmJDK8-RHEL7

      org.infinispan.server.test.client.hotrod.security.HotRodPlainAuthLdapOverSslIT#testReader
      env=: udp-IbmJDK8-RHEL7

      org.infinispan.server.test.client.hotrod.security.HotRodPlainAuthLdapOverSslIT#testWriter
      env=: udp-IbmJDK8-RHEL7

      org.infinispan.server.test.client.hotrod.security.HotRodPlainAuthLdapOverSslIT#testSupervisor
      env=: udp-IbmJDK8-RHEL7

      org.infinispan.server.test.client.hotrod.security.HotRodSslEncryptionIT#testViaDirectConfig
      env=: udp-IbmJDK8-RHEL7

      org.infinispan.server.test.client.hotrod.security.HotRodSslWithSniEncryptionIT#testAuthorizedAccessThroughSni
      env=: udp-IbmJDK8-RHEL7

      org.infinispan.server.test.configs.ExampleConfigsIT#testRocksDBCacheStoreConfig
      env=: udp-OpenJDK8-windows2012r2

      org.infinispan.server.test.cs.rocksdb.RocksDBCacheStoreIT#testDataSurvivesRestart
      env=: udp-OpenJDK8-windows2012r2

      org.infinispan.server.test.cs.rocksdb.RocksDBCacheStoreIT#testDataRetrievableViaRocksDbApi
      env=: udp-OpenJDK8-windows2012r2

      org.infinispan.server.test.query.RemoteQueryCompatModeIT#testCompatQuery
      env=: tcp-OpenJDK8-RHEL8

        Gliffy Diagrams

          Attachments

            Activity

              People

              • Assignee:
                NadirX Tristan Tarrant
                Reporter:
                dlovison Diego Lovison
              • Votes:
                0 Vote for this issue
                Watchers:
                1 Start watching this issue

                Dates

                • Created:
                  Updated:
                  Resolved: