Uploaded image for project: 'Fuse Tooling'
  1. Fuse Tooling
  2. FUSETOOLS-3457

-Pfuse parameter used in jbds-installer does not work on macOS

    XMLWordPrintable

Details

    Description

      see https://gitlab.cee.redhat.com/fuse-tooling-qe/jbds-installer/-/blob/master/devstudio-12.19.0.AM1/pom.xml#L57

      [INFO] Scanning for projects...
      [INFO]
      [INFO] -------< org.jboss.apodhrad.jbds.installer:devstudio-12.18.0.GA >-------
      [INFO] Building devstudio-12.18.0.GA 0.0.1-SNAPSHOT
      [INFO] --------------------------------[ pom ]---------------------------------
      [INFO]
      [INFO] --- maven-clean-plugin:2.5:clean (default-clean) @ devstudio-12.18.0.GA ---
      [INFO] Deleting /Users/djelinek/develop/repos/jbds-installer/devstudio-12.18.0.GA/target
      [INFO]
      [INFO] --- maven-resources-plugin:3.0.2:copy-resources (copy-resources) @ devstudio-12.18.0.GA ---
      [INFO] Using 'UTF-8' encoding to copy filtered resources.
      [INFO] Copying 3 resources
      [INFO]
      [INFO] --- properties-maven-plugin:1.0.0:read-project-properties (default) @ devstudio-12.18.0.GA ---
      [INFO]
      [INFO] --- jeclipse-maven-plugin:1.0.12:install (jbds) @ devstudio-12.18.0.GA ---
      [INFO] The folder '/Users/djelinek/Downloads' will be used for caching.
      [INFO] JRE: /Users/djelinek/develop/tools/java/jdk-11.0.10.jdk/Contents/Home/bin/java
      [INFO] Eclipse execution timeout set to 3600 s.
      [INFO] Command: /Users/djelinek/develop/tools/java/jdk-11.0.10.jdk/Contents/Home/bin/java -jar /Users/djelinek/develop/repos/jbds-installer/devstudio-12.18.0.GA/target/codereadystudio-12.18.0.GA-installer-standalone.jar /Users/djelinek/develop/repos/jbds-installer/devstudio-12.18.0.GA/target/installation.xml
      [INFO] [ Starting automated installation ]
      [INFO] [INFO]  Selected JVM Information
      [INFO] [INFO]  Location : /Users/djelinek/develop/tools/java/jdk-11.0.10.jdk/Contents/Home
      [INFO] [INFO]  Vendor   : Oracle Corporation
      [INFO] [INFO]  Version  : 11.0.10
      [INFO] [INFO]  Arch     : 64-bit
      [INFO] [WARNING] Visual Page Editor for JSF is not supported for selected JVM
      [INFO] [ Starting to unpack ]
      [INFO] [ Processing package: P2 Director Application (1/3) ]
      [INFO] [ Processing package: Red Hat CodeReady Studio 12.18.0.GA (2/3) ]
      [INFO] [ Processing package: Red Hat CodeReady Studio 12.18.0.GA Metadata Generation (3/3) ]
      [INFO] [ Unpacking finished ]
      [INFO] [ Creating shortcuts  done. ]
      [INFO] [ Add shortcuts to uninstaller  done. ]
      [INFO] [ Writing the uninstaller data ... ]
      [INFO] [ Automated installation done ]
      [INFO] Delete installer /Users/djelinek/develop/repos/jbds-installer/devstudio-12.18.0.GA/target/codereadystudio-12.18.0.GA-installer-standalone.jar
      [INFO] Eclipse execution timeout set to 3600 s.
      [INFO] Command: /Users/djelinek/develop/tools/java/jdk-11.0.10.jdk/Contents/Home/bin/java -jar /Users/djelinek/develop/repos/jbds-installer/devstudio-12.18.0.GA/target/jbdevstudio/studio/codereadystudio.app/Contents/Eclipse/plugins/org.eclipse.equinox.launcher_1.5.800.v20200727-1323.jar -application org.eclipse.equinox.p2.director -consoleLog -followReferences -nosplash -repository  -installIUs org.fusesource.ide.server.extensions.feature.feature.group,org.fusesource.ide.core.feature.feature.group,com.github.cameltooling.lsp.eclipse.client.feature.feature.group,org.fusesource.ide.jmx.feature.feature.group,org.jboss.tools.fuse.transformation.feature.feature.group,org.fusesource.ide.camel.editor.feature.feature.group,org.fusesource.ide.syndesis.extension.feature.feature.group
      [INFO] Installation failed.
      [INFO] Unable to load repositories.
      [INFO] !SESSION 2021-03-11 14:45:29.437 -----------------------------------------------
      [INFO] eclipse.buildId=12.18.0.GA-v20210115-1005-B7439
      [INFO] java.version=11.0.10
      [INFO] java.vendor=Oracle Corporation
      [INFO] BootLoader constants: OS=macosx, ARCH=x86_64, WS=cocoa, NL=en_CZ
      [INFO] Framework arguments:  -application org.eclipse.equinox.p2.director -followReferences -repository  -installIUs org.fusesource.ide.server.extensions.feature.feature.group,org.fusesource.ide.core.feature.feature.group,com.github.cameltooling.lsp.eclipse.client.feature.feature.group,org.fusesource.ide.jmx.feature.feature.group,org.jboss.tools.fuse.transformation.feature.feature.group,org.fusesource.ide.camel.editor.feature.feature.group,org.fusesource.ide.syndesis.extension.feature.feature.group
      [INFO] Command-line arguments:  -application org.eclipse.equinox.p2.director -consoleLog -followReferences -repository  -installIUs org.fusesource.ide.server.extensions.feature.feature.group,org.fusesource.ide.core.feature.feature.group,com.github.cameltooling.lsp.eclipse.client.feature.feature.group,org.fusesource.ide.jmx.feature.feature.group,org.jboss.tools.fuse.transformation.feature.feature.group,org.fusesource.ide.camel.editor.feature.feature.group,org.fusesource.ide.syndesis.extension.feature.feature.group
      [INFO]
      [INFO] !ENTRY org.eclipse.equinox.p2.core 4 0 2021-03-11 14:45:33.551
      [INFO] !MESSAGE Unable to load repositories.
      [INFO] There were errors. See log file: /Users/djelinek/develop/repos/jbds-installer/devstudio-12.18.0.GA/target/jbdevstudio/studio/codereadystudio.app/Contents/Eclipse/configuration/1615470329571.log
      [INFO] ------------------------------------------------------------------------
      [INFO] BUILD FAILURE
      [INFO] ------------------------------------------------------------------------
      [INFO] Total time:  03:05 min
      [INFO] Finished at: 2021-03-11T14:45:35+01:00
      [INFO] ------------------------------------------------------------------------
      [ERROR] Failed to execute goal org.apodhrad.jeclipse:jeclipse-maven-plugin:1.0.12:install (jbds) on project devstudio-12.18.0.GA: Execution jbds of goal org.apodhrad.jeclipse:jeclipse-maven-plugin:1.0.12:install failed: Installation failed. -> [Help 1]
      [ERROR]
      [ERROR] To see the full stack trace of the errors, re-run Maven with the -e switch.
      [ERROR] Re-run Maven using the -X switch to enable full debug logging.
      [ERROR]
      [ERROR] For more information about the errors and possible solutions, please read the following articles:
      [ERROR] [Help 1] http://cwiki.apache.org/confluence/display/MAVEN/PluginExecutionException
      

      Attachments

        Activity

          People

            djelinek Dominik Jelínek
            djelinek Dominik Jelínek
            Votes:
            0 Vote for this issue
            Watchers:
            1 Start watching this issue

            Dates

              Created:
              Updated:
              Resolved: