Details

    • Type: Bug
    • Status: Closed (View Workflow)
    • Priority: Major
    • Resolution: Done
    • Affects Version/s: 11.1.0.AM1
    • Fix Version/s: 11.1.0.AM3
    • Component/s: QE
    • Labels:
      None
    • Sprint:
      11.1.0.AM3 - QE

      Description

      11:12:35.926 ERROR [WorkbenchTestable][RequirementsRunner] Exception in test: testDeploymentToOpenShift 192.168.42.5:8443(org.jboss.tools.fuse.ui.bot.tests.FuseOnOpenShiftTest)
      org.eclipse.reddeer.core.exception.CoreLayerException: Tree Item org.eclipse.reddeer.core.handler.TreeItemHandler@3d5eb51e has no Tree Item with text camel-ose-springboot-xml
      Exception details:
      	Tree Item org.eclipse.reddeer.core.handler.TreeItemHandler@3d5eb51e has these direct children:
      	  developer https://192.168.42.5:8443
      	at org.eclipse.reddeer.core.handler.TreeItemHandler.getItem(TreeItemHandler.java:214)
      	at org.eclipse.reddeer.swt.impl.tree.AbstractTreeItem.getItem(AbstractTreeItem.java:126)
      	at org.jboss.tools.fuse.reddeer.view.OpenShiftExplorer.openPodLog(OpenShiftExplorer.java:126)
      	at org.jboss.tools.fuse.ui.bot.tests.FuseOnOpenShiftTest.testDeploymentToOpenShift(FuseOnOpenShiftTest.java:146)
      	at sun.reflect.NativeMethodAccessorImpl.invoke0(Native Method)
      	at sun.reflect.NativeMethodAccessorImpl.invoke(NativeMethodAccessorImpl.java:62)
      	at sun.reflect.DelegatingMethodAccessorImpl.invoke(DelegatingMethodAccessorImpl.java:43)
      	at java.lang.reflect.Method.invoke(Method.java:498)
      	at org.junit.runners.model.FrameworkMethod$1.runReflectiveCall(FrameworkMethod.java:50)
      	at org.junit.internal.runners.model.ReflectiveCallable.run(ReflectiveCallable.java:12)
      	at org.junit.runners.model.FrameworkMethod.invokeExplosively(FrameworkMethod.java:47)
      	at org.eclipse.reddeer.junit.internal.runner.statement.RunTestMethod.evaluate(RunTestMethod.java:48)
      	at org.eclipse.reddeer.junit.internal.runner.statement.RunBefores.evaluate(RunBefores.java:85)
      	at org.eclipse.reddeer.junit.internal.runner.statement.RunIBeforeTestExtensions.evaluate(RunIBeforeTestExtensions.java:73)
      	at org.eclipse.reddeer.junit.internal.runner.statement.RunAfters.evaluate(RunAfters.java:72)
      	at org.eclipse.reddeer.junit.internal.runner.statement.RunIAfterTestExtensions.evaluate(RunIAfterTestExtensions.java:59)
      	at org.junit.runners.ParentRunner.runLeaf(ParentRunner.java:325)
      	at org.eclipse.reddeer.junit.internal.runner.RequirementsRunner.runChild(RequirementsRunner.java:171)
      	at org.junit.runners.BlockJUnit4ClassRunner.runChild(BlockJUnit4ClassRunner.java:57)
      	at org.junit.runners.ParentRunner$3.run(ParentRunner.java:290)
      	at org.junit.runners.ParentRunner$1.schedule(ParentRunner.java:71)
      	at org.junit.runners.ParentRunner.runChildren(ParentRunner.java:288)
      	at org.junit.runners.ParentRunner.access$000(ParentRunner.java:58)
      	at org.junit.runners.ParentRunner$2.evaluate(ParentRunner.java:268)
      	at org.eclipse.reddeer.junit.internal.runner.statement.RunBeforeClasses.evaluate(RunBeforeClasses.java:81)
      	at org.eclipse.reddeer.junit.internal.runner.statement.FulfillRequirementsStatement.evaluate(FulfillRequirementsStatement.java:46)
      	at org.eclipse.reddeer.junit.internal.runner.statement.RunIBeforeClassExtensions.evaluate(RunIBeforeClassExtensions.java:72)
      	at org.eclipse.reddeer.junit.internal.runner.statement.RunAfterClasses.evaluate(RunAfterClasses.java:68)
      	at org.eclipse.reddeer.junit.internal.runner.statement.CleanUpRequirementStatement.evaluate(CleanUpRequirementStatement.java:45)
      	at org.eclipse.reddeer.junit.internal.runner.statement.RunIAfterClassExtensions.evaluate(RunIAfterClassExtensions.java:57)
      	at org.junit.runners.ParentRunner.run(ParentRunner.java:363)
      	at org.eclipse.reddeer.junit.internal.runner.RequirementsRunner.run(RequirementsRunner.java:153)
      	at org.junit.runners.Suite.runChild(Suite.java:128)
      	at org.junit.runners.Suite.runChild(Suite.java:27)
      	at org.junit.runners.ParentRunner$3.run(ParentRunner.java:290)
      	at org.junit.runners.ParentRunner$1.schedule(ParentRunner.java:71)
      	at org.junit.runners.ParentRunner.runChildren(ParentRunner.java:288)
      	at org.junit.runners.ParentRunner.access$000(ParentRunner.java:58)
      	at org.junit.runners.ParentRunner$2.evaluate(ParentRunner.java:268)
      	at org.junit.runners.ParentRunner.run(ParentRunner.java:363)
      	at org.junit.runners.Suite.runChild(Suite.java:128)
      	at org.junit.runners.Suite.runChild(Suite.java:27)
      	at org.junit.runners.ParentRunner$3.run(ParentRunner.java:290)
      	at org.junit.runners.ParentRunner$1.schedule(ParentRunner.java:71)
      	at org.junit.runners.ParentRunner.runChildren(ParentRunner.java:288)
      	at org.junit.runners.ParentRunner.access$000(ParentRunner.java:58)
      	at org.junit.runners.ParentRunner$2.evaluate(ParentRunner.java:268)
      	at org.junit.runners.ParentRunner.run(ParentRunner.java:363)
      	at org.apache.maven.surefire.junit4.JUnit4Provider.execute(JUnit4Provider.java:367)
      	at org.apache.maven.surefire.junit4.JUnit4Provider.executeWithRerun(JUnit4Provider.java:274)
      	at org.apache.maven.surefire.junit4.JUnit4Provider.executeTestSet(JUnit4Provider.java:238)
      	at org.apache.maven.surefire.junit4.JUnit4Provider.invoke(JUnit4Provider.java:161)
      	at sun.reflect.NativeMethodAccessorImpl.invoke0(Native Method)
      	at sun.reflect.NativeMethodAccessorImpl.invoke(NativeMethodAccessorImpl.java:62)
      	at sun.reflect.DelegatingMethodAccessorImpl.invoke(DelegatingMethodAccessorImpl.java:43)
      	at java.lang.reflect.Method.invoke(Method.java:498)
      	at org.apache.maven.surefire.util.ReflectionUtils.invokeMethodWithArray2(ReflectionUtils.java:202)
      	at org.apache.maven.surefire.booter.ProviderFactory$ProviderProxy.invoke(ProviderFactory.java:155)
      	at org.apache.maven.surefire.booter.ProviderFactory.invokeProvider(ProviderFactory.java:81)
      	at org.eclipse.tycho.surefire.osgibooter.OsgiSurefireBooter.run(OsgiSurefireBooter.java:107)
      	at org.eclipse.tycho.surefire.osgibooter.AbstractUITestApplication.runTests(AbstractUITestApplication.java:44)
      	at org.eclipse.e4.ui.internal.workbench.swt.E4Testable.lambda$0(E4Testable.java:73)
      	at java.lang.Thread.run(Thread.java:748)
      11:12:35.935 INFO [WorkbenchTestable][RequirementsRunner] Finished test: testDeploymentToOpenShift 192.168.42.5:8443(org.jboss.tools.fuse.ui.bot.tests.FuseOnOpenShiftTest)
      11:12:35.937 DEBUG [WorkbenchTestable][RunIAfterClassExtensions] Run after class extensions for test class org.jboss.tools.fuse.ui.bot.tests.FuseOnOpenShiftTest
      11:12:35.937 DEBUG [WorkbenchTestable][RunIAfterClassExtensions] Run method runAfterTestClass() of class org.eclipse.reddeer.junit.extension.after.test.impl.CloseAllShellsExt
      11:12:35.938 INFO [WorkbenchTestable][WorkbenchShellHandler] Closing all shells...
      11:12:35.952 DEBUG [WorkbenchTestable][AbstractWait] Waiting until active shell exists...
      11:12:35.952 DEBUG [WorkbenchTestable][AbstractWait] Waiting until active shell exists finished successfully
      Tests run: 1, Failures: 0, Errors: 1, Skipped: 0, Time elapsed: 289.581 sec <<< FAILURE! - in org.jboss.tools.fuse.ui.bot.tests.FuseOnOpenShiftTest
      testDeploymentToOpenShift 192.168.42.5:8443(org.jboss.tools.fuse.ui.bot.tests.FuseOnOpenShiftTest)  Time elapsed: 270.838 sec  <<< ERROR!
      org.eclipse.reddeer.core.exception.CoreLayerException: Tree Item org.eclipse.reddeer.core.handler.TreeItemHandler@3d5eb51e has no Tree Item with text camel-ose-springboot-xml
      	at org.jboss.tools.fuse.ui.bot.tests.FuseOnOpenShiftTest.testDeploymentToOpenShift(FuseOnOpenShiftTest.java:146)
      

        Gliffy Diagrams

          Attachments

            Activity

              People

              • Assignee:
                tsedmik Tomáš Sedmík
                Reporter:
                tsedmik Tomáš Sedmík
              • Votes:
                0 Vote for this issue
                Watchers:
                2 Start watching this issue

                Dates

                • Created:
                  Updated:
                  Resolved:

                  Time Tracking

                  Estimated:
                  Original Estimate - 2 hours Original Estimate - 2 hours
                  2h
                  Remaining:
                  Remaining Estimate - 0 minutes
                  0m
                  Logged:
                  Time Spent - 3 hours
                  3h