Uploaded image for project: 'Red Hat Fuse'
  1. Red Hat Fuse
  2. ENTESB-13788

Migrate Kafka integration testing to docker

    XMLWordPrintable

Details

    • build2

    Description

      I see this with the camel-2.23.x.redhat-7-x branch

      [ERROR] Tests run: 1, Failures: 0, Errors: 1, Skipped: 0, Time elapsed: 0.246 s <<< FAILURE! - in org.apache.camel.component.kafka.KafkaConsumerRebalanceTest
      [ERROR] org.apache.camel.component.kafka.KafkaConsumerRebalanceTest  Time elapsed: 0.244 s  <<< ERROR!
      java.lang.NoSuchMethodError: scala.Predef$.refArrayOps([Ljava/lang/Object;)[Ljava/lang/Object;
      

      Attachments

        Activity

          People

            tdiesler@redhat.com Thomas Diesler
            tdiesler@redhat.com Thomas Diesler
            Viliam Kasala Viliam Kasala
            Votes:
            0 Vote for this issue
            Watchers:
            3 Start watching this issue

            Dates

              Created:
              Updated:
              Resolved: