Uploaded image for project: 'Debezium'
  1. Debezium
  2. DBZ-4294

Random test failure - ZZZGtidSetIT#shouldProcessPurgedGtidSet

    XMLWordPrintable

Details

    Description

      Test failed with:

      2021-11-16T16:15:26.3087645Z [ERROR] io.debezium.connector.mysql.zzz.ZZZGtidSetIT.shouldProcessPurgedGtidSet  Time elapsed: 1.601 s  <<< FAILURE!
      2021-11-16T16:15:26.3089709Z java.lang.AssertionError: actual value:<'1'> should not be equal to:<'1'>
      2021-11-16T16:15:26.3091126Z 	at io.debezium.connector.mysql.zzz.ZZZGtidSetIT.lambda$shouldProcessPurgedGtidSet$2(ZZZGtidSetIT.java:126)
      2021-11-16T16:15:26.3093395Z 	at io.debezium.connector.mysql.zzz.ZZZGtidSetIT.shouldProcessPurgedGtidSet(ZZZGtidSetIT.java:121)
      

      See the attached logs for details.

      Attachments

        Activity

          People

            gmorling@redhat.com Gunnar Morling
            ccranfor@redhat.com Chris Cranford
            Votes:
            0 Vote for this issue
            Watchers:
            4 Start watching this issue

            Dates

              Created:
              Updated:
              Resolved: