Uploaded image for project: 'Debezium'
  1. Debezium
  2. DBZ-2319

Intermittent test failure on CI - PostgresConnectorIT#shouldOutputRecordsInCloudEventsFormat

    XMLWordPrintable

    Details

      Description

      See https://api.travis-ci.org/v3/job/706228962/log.txt

      [ERROR] Tests run: 47, Failures: 0, Errors: 1, Skipped: 2, Time elapsed: 99.524 s <<< FAILURE! - in io.debezium.connector.postgresql.PostgresConnectorIT
      [ERROR] shouldOutputRecordsInCloudEventsFormat(io.debezium.connector.postgresql.PostgresConnectorIT)  Time elapsed: 2.785 s  <<< ERROR!
      org.awaitility.core.ConditionTimeoutException: Condition with lambda expression in io.debezium.connector.postgresql.PostgresConnectorIT was not fulfilled within 2 seconds.
      	at io.debezium.connector.postgresql.PostgresConnectorIT.shouldOutputRecordsInCloudEventsFormat(PostgresConnectorIT.java:1644)
      Caused by: java.util.concurrent.TimeoutException
      	at io.debezium.connector.postgresql.PostgresConnectorIT.shouldOutputRecordsInCloudEventsFormat(PostgresConnectorIT.java:1644)
      

        Attachments

          Activity

            People

            Assignee:
            ccranfor Chris Cranford
            Reporter:
            ccranfor Chris Cranford
            Votes:
            0 Vote for this issue
            Watchers:
            2 Start watching this issue

              Dates

              Created:
              Updated:
              Resolved: