Uploaded image for project: 'Debezium'
  1. Debezium
  2. DBZ-2220

Intermittent test failure on CI - SqlServerConnectorIT#verifyOffsets()

    XMLWordPrintable

Details

    Description

      [INFO] Results:
      [INFO] 
      [ERROR] Failures: 
      [ERROR]   SqlServerConnectorIT.verifyOffsets:740->assertRecord:1649->lambda$assertRecord$8:1649 [Values don't match for id] expected:<10[0]> but was:<10[]>
      [INFO] 
      [ERROR] Tests run: 82, Failures: 1, Errors: 0, Skipped: 0
      

      See https://api.travis-ci.org/v3/job/699363707/log.txt

      And another one in the same test method, see https://api.travis-ci.org/v3/job/699622298/log.txt.

      [ERROR]   SqlServerConnectorIT.verifyOffsets:725 expecting actual value not to be null
      [INFO] 
      [ERROR] Tests run: 82, Failures: 1, Errors: 0, Skipped: 0
      

      Attachments

        Activity

          People

            ccranfor@redhat.com Chris Cranford
            gmorling@redhat.com Gunnar Morling
            Votes:
            0 Vote for this issue
            Watchers:
            3 Start watching this issue

            Dates

              Created:
              Updated:
              Resolved: