Details

    • Type: Bug
    • Status: Resolved (View Workflow)
    • Priority: Major
    • Resolution: Done
    • Affects Version/s: 2.0
    • Fix Version/s: 2.0
    • Component/s: build
    • Labels:
      None

      Description

      After using the installer to :

      ant install-bpel-console

      The installation itself fails on genkey for me :

      install-jboss:
      [genkey] Generating Key for vault
      [genkey] Generating Key for overlord
      [java] Storing a password in the password vault.
      [java] java.lang.Exception: Exception encountered:java.lang.RuntimeException: PBOX000137: Security Vault does not contain SecretKey entry under alias (vault)
      [java] at org.jboss.as.security.vault.VaultSession.initSecurityVault(VaultSession.java:194)
      [java] at org.jboss.as.security.vault.VaultSession.startVaultSession(VaultSession.java:212)
      [java] at org.overlord.commons.auth.jboss7.tools.AuthTool.storePassword(AuthTool.java:97)
      [java] at org.overlord.commons.auth.jboss7.tools.AuthTool.main(AuthTool.java:45)
      [java] at sun.reflect.NativeMethodAccessorImpl.invoke0(Native Method)
      [java] at sun.reflect.NativeMethodAccessorImpl.invoke(NativeMethodAccessorImpl.java:57)
      [java] at sun.reflect.DelegatingMethodAccessorImpl.invoke(DelegatingMethodAccessorImpl.java:43)
      [java] at java.lang.reflect.Method.invoke(Method.java:606)
      [java] at org.jboss.modules.Module.run(Module.java:312)
      [java] at org.jboss.modules.Main.main(Main.java:473)
      [java] Caused by: org.jboss.security.vault.SecurityVaultException: java.lang.RuntimeException: PBOX000137: Security Vault does not contain SecretKey entry under alias (vault)
      [java] at org.picketbox.plugins.vault.PicketBoxSecurityVault.readVaultContent(PicketBoxSecurityVault.java:487)
      [java] at org.picketbox.plugins.vault.PicketBoxSecurityVault.init(PicketBoxSecurityVault.java:214)
      [java] at org.jboss.as.security.vault.VaultSession.initSecurityVault(VaultSession.java:191)
      [java] ... 9 more
      [java] Caused by: java.lang.RuntimeException: PBOX000137: Security Vault does not contain SecretKey entry under alias (vault)
      [java] at org.picketbox.plugins.vault.PicketBoxSecurityVault.setUpVault(PicketBoxSecurityVault.java:379)
      [java] at org.picketbox.plugins.vault.PicketBoxSecurityVault.readVaultContent(PicketBoxSecurityVault.java:482)
      [java] ... 11 more

      BUILD FAILED
      /Users/cunningt/src/switchyard/pullrequest/release/installer/target/switchyard-installer-2.0/build.xml:213: The following error occurred while executing this line:
      /Users/cunningt/src/switchyard/pullrequest/release/installer/target/switchyard-installer-2.0/res/overlord-commons/build.xml:31: The following error occurred while executing this line:
      /Users/cunningt/src/switchyard/pullrequest/release/installer/target/switchyard-installer-2.0/res/overlord-commons/scripts/jboss-eap-6.xml:29: The following error occurred while executing this line:
      /Users/cunningt/src/switchyard/pullrequest/release/installer/target/switchyard-installer-2.0/res/overlord-commons/scripts/jboss-eap-6.xml:46: The following error occurred while executing this line:
      /Users/cunningt/src/switchyard/pullrequest/release/installer/target/switchyard-installer-2.0/res/overlord-commons/scripts/jboss-eap-6.xml:78: The following error occurred while executing this line:
      /Users/cunningt/src/switchyard/pullrequest/release/installer/target/switchyard-installer-2.0/res/overlord-commons/scripts/jboss-eap-6.xml:119: Java returned: 1

      Total time: 11 seconds
      lilguylaptop:switchyard-installer-2.0 cunningt$

      Deployment of the console fails as well :

      Caused by: java.lang.ClassNotFoundException: org.picketlink.identity.federation.saml.v2.assertion.AssertionType from [Module "deployment.switchyard-bpel-console-server.war:main" from Service Module Loader]
      at org.jboss.modules.ModuleClassLoader.findClass(ModuleClassLoader.java:213) [jboss-modules.jar:1.3.6.Final-redhat-1]
      at org.jboss.modules.ConcurrentClassLoader.performLoadClassUnchecked(ConcurrentClassLoader.java:459) [jboss-modules.jar:1.3.6.Final-redhat-1]
      at org.jboss.modules.ConcurrentClassLoader.performLoadClassChecked(ConcurrentClassLoader.java:408) [jboss-modules.jar:1.3.6.Final-redhat-1]
      at org.jboss.modules.ConcurrentClassLoader.performLoadClass(ConcurrentClassLoader.java:389) [jboss-modules.jar:1.3.6.Final-redhat-1]
      at org.jboss.modules.ConcurrentClassLoader.loadClass(ConcurrentClassLoader.java:134) [jboss-modules.jar:1.3.6.Final-redhat-1]
      ... 15 more

        Gliffy Diagrams

          Attachments

            Activity

              People

              • Assignee:
                tcunning Thomas Cunningham
                Reporter:
                tcunning Thomas Cunningham
              • Votes:
                0 Vote for this issue
                Watchers:
                1 Start watching this issue

                Dates

                • Created:
                  Updated:
                  Resolved: