Uploaded image for project: 'SwitchYard'
  1. SwitchYard
  2. SWITCHYARD-2645

org.switchyard.test.quickstarts.HttpBindingQuickstartTest failing on Wildfly

    Details

    • Type: Bug
    • Status: Resolved (View Workflow)
    • Priority: Major
    • Resolution: Done
    • Affects Version/s: 2.0
    • Fix Version/s: 2.0
    • Component/s: quickstarts
    • Labels:
      None

      Description

      org.switchyard.test.quickstarts.HttpBindingQuickstartTest is failing on Wildfly :

      -------------------------------------------------------------------------------
      Test set: org.switchyard.test.quickstarts.HttpBindingQuickstartTest
      -------------------------------------------------------------------------------
      Tests run: 4, Failures: 1, Errors: 0, Skipped: 0, Time elapsed: 14.465 sec <<< FAILURE!
      headers(org.switchyard.test.quickstarts.HttpBindingQuickstartTest) Time elapsed: 0.035 sec <<< FAILURE!
      java.lang.AssertionError
      at org.junit.Assert.fail(Assert.java:86)
      at org.junit.Assert.assertTrue(Assert.java:41)
      at org.junit.Assert.assertTrue(Assert.java:52)
      at org.switchyard.test.quickstarts.HttpBindingQuickstartTest.headers(HttpBindingQuickstartTest.java:94)
      at sun.reflect.NativeMethodAccessorImpl.invoke0(Native Method)
      at sun.reflect.NativeMethodAccessorImpl.invoke(NativeMethodAccessorImpl.java:57)
      at sun.reflect.DelegatingMethodAccessorImpl.invoke(DelegatingMethodAccessorImpl.java:43)
      at java.lang.reflect.Method.invoke(Method.java:606)
      at org.junit.runners.model.FrameworkMethod$1.runReflectiveCall(FrameworkMethod.java:47)
      at org.junit.internal.runners.model.ReflectiveCallable.run(ReflectiveCallable.java:12)
      at org.junit.runners.model.FrameworkMethod.invokeExplosively(FrameworkMethod.java:44)
      at org.jboss.arquillian.junit.Arquillian$6$1.invoke(Arquillian.java:270)
      at org.jboss.arquillian.container.test.impl.execution.LocalTestExecuter.execute(LocalTestExecuter.java:60)
      at sun.reflect.NativeMethodAccessorImpl.invoke0(Native Method)
      at sun.reflect.NativeMethodAccessorImpl.invoke(NativeMethodAccessorImpl.java:57)
      at sun.reflect.DelegatingMethodAccessorImpl.invoke(DelegatingMethodAccessorImpl.java:43)
      at java.lang.reflect.Method.invoke(Method.java:606)
      at org.jboss.arquillian.core.impl.ObserverImpl.invoke(ObserverImpl.java:94)
      at org.jboss.arquillian.core.impl.EventContextImpl.invokeObservers(EventContextImpl.java:99)
      at org.jboss.arquillian.core.impl.EventContextImpl.proceed(EventContextImpl.java:81)
      at org.jboss.arquillian.core.impl.ManagerImpl.fire(ManagerImpl.java:135)
      at org.jboss.arquillian.core.impl.ManagerImpl.fire(ManagerImpl.java:115)
      at org.jboss.arquillian.core.impl.EventImpl.fire(EventImpl.java:67)
      at org.jboss.arquillian.container.test.impl.execution.ClientTestExecuter.execute(ClientTestExecuter.java:53)
      at sun.reflect.NativeMethodAccessorImpl.invoke0(Native Method)
      at sun.reflect.NativeMethodAccessorImpl.invoke(NativeMethodAccessorImpl.java:57)
      at sun.reflect.DelegatingMethodAccessorImpl.invoke(DelegatingMethodAccessorImpl.java:43)
      at java.lang.reflect.Method.invoke(Method.java:606)
      at org.jboss.arquillian.core.impl.ObserverImpl.invoke(ObserverImpl.java:94)
      at org.jboss.arquillian.core.impl.EventContextImpl.invokeObservers(EventContextImpl.java:99)
      at org.jboss.arquillian.core.impl.EventContextImpl.proceed(EventContextImpl.java:81)
      at org.jboss.arquillian.container.test.impl.client.ContainerEventController.createContext(ContainerEventController.java:142)
      at org.jboss.arquillian.container.test.impl.client.ContainerEventController.createTestContext(ContainerEventController.java:129)
      at sun.reflect.NativeMethodAccessorImpl.invoke0(Native Method)
      at sun.reflect.NativeMethodAccessorImpl.invoke(NativeMethodAccessorImpl.java:57)
      at sun.reflect.DelegatingMethodAccessorImpl.invoke(DelegatingMethodAccessorImpl.java:43)
      at java.lang.reflect.Method.invoke(Method.java:606)
      at org.jboss.arquillian.core.impl.ObserverImpl.invoke(ObserverImpl.java:94)
      at org.jboss.arquillian.core.impl.EventContextImpl.proceed(EventContextImpl.java:88)
      at org.jboss.arquillian.test.impl.TestContextHandler.createTestContext(TestContextHandler.java:102)
      at sun.reflect.NativeMethodAccessorImpl.invoke0(Native Method)
      at sun.reflect.NativeMethodAccessorImpl.invoke(NativeMethodAccessorImpl.java:57)
      at sun.reflect.DelegatingMethodAccessorImpl.invoke(DelegatingMethodAccessorImpl.java:43)
      at java.lang.reflect.Method.invoke(Method.java:606)
      at org.jboss.arquillian.core.impl.ObserverImpl.invoke(ObserverImpl.java:94)
      at org.jboss.arquillian.core.impl.EventContextImpl.proceed(EventContextImpl.java:88)
      at org.jboss.arquillian.test.impl.TestContextHandler.createClassContext(TestContextHandler.java:84)
      at sun.reflect.NativeMethodAccessorImpl.invoke0(Native Method)
      at sun.reflect.NativeMethodAccessorImpl.invoke(NativeMethodAccessorImpl.java:57)
      at sun.reflect.DelegatingMethodAccessorImpl.invoke(DelegatingMethodAccessorImpl.java:43)
      at java.lang.reflect.Method.invoke(Method.java:606)
      at org.jboss.arquillian.core.impl.ObserverImpl.invoke(ObserverImpl.java:94)
      at org.jboss.arquillian.core.impl.EventContextImpl.proceed(EventContextImpl.java:88)
      at org.jboss.arquillian.test.impl.TestContextHandler.createSuiteContext(TestContextHandler.java:65)
      at sun.reflect.NativeMethodAccessorImpl.invoke0(Native Method)
      at sun.reflect.NativeMethodAccessorImpl.invoke(NativeMethodAccessorImpl.java:57)
      at sun.reflect.DelegatingMethodAccessorImpl.invoke(DelegatingMethodAccessorImpl.java:43)
      at java.lang.reflect.Method.invoke(Method.java:606)
      at org.jboss.arquillian.core.impl.ObserverImpl.invoke(ObserverImpl.java:94)
      at org.jboss.arquillian.core.impl.EventContextImpl.proceed(EventContextImpl.java:88)
      at org.jboss.arquillian.core.impl.ManagerImpl.fire(ManagerImpl.java:135)
      at org.jboss.arquillian.test.impl.EventTestRunnerAdaptor.test(EventTestRunnerAdaptor.java:111)
      at org.jboss.arquillian.junit.Arquillian$6.evaluate(Arquillian.java:263)
      at org.jboss.arquillian.junit.Arquillian$4.evaluate(Arquillian.java:226)
      at org.jboss.arquillian.junit.Arquillian.multiExecute(Arquillian.java:314)
      at org.jboss.arquillian.junit.Arquillian.access$100(Arquillian.java:46)
      at org.jboss.arquillian.junit.Arquillian$5.evaluate(Arquillian.java:240)
      at org.junit.runners.ParentRunner.runLeaf(ParentRunner.java:271)
      at org.junit.runners.BlockJUnit4ClassRunner.runChild(BlockJUnit4ClassRunner.java:70)
      at org.junit.runners.BlockJUnit4ClassRunner.runChild(BlockJUnit4ClassRunner.java:50)
      at org.junit.runners.ParentRunner$3.run(ParentRunner.java:238)
      at org.junit.runners.ParentRunner$1.schedule(ParentRunner.java:63)
      at org.junit.runners.ParentRunner.runChildren(ParentRunner.java:236)
      at org.junit.runners.ParentRunner.access$000(ParentRunner.java:53)
      at org.junit.runners.ParentRunner$2.evaluate(ParentRunner.java:229)
      at org.jboss.arquillian.junit.Arquillian$2.evaluate(Arquillian.java:185)
      at org.jboss.arquillian.junit.Arquillian.multiExecute(Arquillian.java:314)
      at org.jboss.arquillian.junit.Arquillian.access$100(Arquillian.java:46)
      at org.jboss.arquillian.junit.Arquillian$3.evaluate(Arquillian.java:199)
      at org.junit.runners.ParentRunner.run(ParentRunner.java:309)
      at org.jboss.arquillian.junit.Arquillian.run(Arquillian.java:147)
      at org.apache.maven.surefire.junit4.JUnit4TestSet.execute(JUnit4TestSet.java:59)
      at org.apache.maven.surefire.suite.AbstractDirectoryTestSuite.executeTestSet(AbstractDirectoryTestSuite.java:120)
      at org.apache.maven.surefire.suite.AbstractDirectoryTestSuite.execute(AbstractDirectoryTestSuite.java:145)
      at org.apache.maven.surefire.Surefire.run(Surefire.java:104)
      at sun.reflect.NativeMethodAccessorImpl.invoke0(Native Method)
      at sun.reflect.NativeMethodAccessorImpl.invoke(NativeMethodAccessorImpl.java:57)
      at sun.reflect.DelegatingMethodAccessorImpl.invoke(DelegatingMethodAccessorImpl.java:43)
      at java.lang.reflect.Method.invoke(Method.java:606)
      at org.apache.maven.surefire.booter.SurefireBooter.runSuitesInProcess(SurefireBooter.java:290)
      at org.apache.maven.surefire.booter.SurefireBooter.main(SurefireBooter.java:1017)

        Gliffy Diagrams

          Attachments

            Activity

              People

              • Assignee:
                igarashitm tomohisa igarashi
                Reporter:
                tcunning Thomas Cunningham
              • Votes:
                0 Vote for this issue
                Watchers:
                2 Start watching this issue

                Dates

                • Created:
                  Updated:
                  Resolved: