Uploaded image for project: 'Forge'
  1. Forge
  2. FORGE-79

windows xp mvn install error

    XMLWordPrintable

Details

    • Hide

      git clone git://github.com/seam/forge.git seam-forge
      cd seam-forge
      mvn install

      Show
      git clone git://github.com/seam/forge.git seam-forge cd seam-forge mvn install

    Description

      Results :

      Failed tests:
      testAbsolutePath(org.jboss.seam.forge.shell.test.plugins.builtin.ChangeDirecto
      ryPluginTest)

      Tests run: 29, Failures: 1, Errors: 0, Skipped: 0

      [INFO] ------------------------------------------------------------------------
      [INFO] Reactor Summary:
      [INFO]
      [INFO] Seam Forge - Parent ............................... SUCCESS [1.609s]
      [INFO] Seam Forge - Targeted Event Bus ................... SUCCESS [4.844s]
      [INFO] Seam Forge - Parser/Java .......................... SUCCESS [19.515s]
      [INFO] Seam Forge - Project Model APIs ................... SUCCESS [7.953s]
      [INFO] Seam Forge - Shell API ............................ SUCCESS [1.157s]
      [INFO] Seam Forge - Test Harness ......................... SUCCESS [0.875s]
      [INFO] Seam Forge - Shell ................................ FAILURE [31.078s]
      [INFO] Seam Forge - Project Model API Tests .............. SKIPPED
      [INFO] Seam Forge - Persistence Plugins .................. SKIPPED
      [INFO] Seam Forge - Web Plugins .......................... SKIPPED
      [INFO] ------------------------------------------------------------------------
      [INFO] BUILD FAILURE
      [INFO] ------------------------------------------------------------------------
      [INFO] Total time: 1:07.563s
      [INFO] Finished at: Sun Dec 05 03:02:34 GMT 2010
      [INFO] Final Memory: 45M/108M
      [INFO] ------------------------------------------------------------------------
      [ERROR] Failed to execute goal org.apache.maven.plugins:maven-surefire-plugin:2.
      5:test (default-test) on project forge-shell: There are test failures.
      [ERROR]
      [ERROR] Please refer to E:\java\seam-forge\shell\target\surefire-reports for the
      individual test results.
      [ERROR] -> [Help 1]
      [ERROR]
      [ERROR] To see the full stack trace of the errors, re-run Maven with the -e swit
      ch.
      [ERROR] Re-run Maven using the -X switch to enable full debug logging.
      [ERROR]
      [ERROR] For more information about the errors and possible solutions, please rea
      d the following articles:
      [ERROR] [Help 1] http://cwiki.apache.org/confluence/display/MAVEN/MojoFailureExc
      eption
      [ERROR]
      [ERROR] After correcting the problems, you can resume the build with the command

      [ERROR] mvn <goals> -rf :forge-shell

      Administrator@PC-201010191529 /e/java/seam-forge (master)

      -------------------------------------------------------------------------------
      Test set: org.jboss.seam.forge.shell.test.plugins.builtin.ChangeDirectoryPluginTest
      -------------------------------------------------------------------------------
      Tests run: 5, Failures: 1, Errors: 0, Skipped: 0, Time elapsed: 4.828 sec <<< FAILURE!
      testAbsolutePath(org.jboss.seam.forge.shell.test.plugins.builtin.ChangeDirectoryPluginTest) Time elapsed: 0.141 sec <<< FAILURE!
      org.junit.ComparisonFailure: expected:<...cuments and Settings[/Administrator]> but was:<...cuments and Settings[]>
      at org.junit.Assert.assertEquals(Assert.java:123)
      at org.junit.Assert.assertEquals(Assert.java:145)
      at org.jboss.seam.forge.shell.test.plugins.builtin.ChangeDirectoryPluginTest.testAbsolutePath(ChangeDirectoryPluginTest.java:123)
      at sun.reflect.NativeMethodAccessorImpl.invoke0(Native Method)
      at sun.reflect.NativeMethodAccessorImpl.invoke(Unknown Source)
      at sun.reflect.DelegatingMethodAccessorImpl.invoke(Unknown Source)
      at java.lang.reflect.Method.invoke(Unknown Source)
      at org.junit.runners.model.FrameworkMethod$1.runReflectiveCall(FrameworkMethod.java:44)
      at org.junit.internal.runners.model.ReflectiveCallable.run(ReflectiveCallable.java:15)
      at org.junit.runners.model.FrameworkMethod.invokeExplosively(FrameworkMethod.java:41)
      at org.jboss.arquillian.junit.Arquillian$6$1.invoke(Arquillian.java:251)
      at org.jboss.arquillian.protocol.local.LocalMethodExecutor.invoke(LocalMethodExecutor.java:40)
      at org.jboss.arquillian.impl.handler.ContainerTestExecuter.callback(ContainerTestExecuter.java:50)
      at org.jboss.arquillian.impl.handler.ContainerTestExecuter.callback(ContainerTestExecuter.java:40)
      at org.jboss.arquillian.impl.event.MapEventManager.fire(MapEventManager.java:63)
      at org.jboss.arquillian.impl.context.AbstractEventContext.fire(AbstractEventContext.java:115)
      at org.jboss.arquillian.impl.EventTestRunnerAdaptor.test(EventTestRunnerAdaptor.java:157)
      at org.jboss.arquillian.junit.Arquillian$6.evaluate(Arquillian.java:244)
      at org.junit.internal.runners.statements.RunBefores.evaluate(RunBefores.java:28)
      at org.jboss.arquillian.junit.Arquillian$4.evaluate(Arquillian.java:207)
      at org.junit.internal.runners.statements.RunAfters.evaluate(RunAfters.java:31)
      at org.jboss.arquillian.junit.Arquillian$5$1.evaluate(Arquillian.java:225)
      at org.jboss.arquillian.junit.Arquillian$MultiStatementExecutor.execute(Arquillian.java:297)
      at org.jboss.arquillian.junit.Arquillian$5.evaluate(Arquillian.java:221)
      at org.junit.runners.BlockJUnit4ClassRunner.runChild(BlockJUnit4ClassRunner.java:76)
      at org.junit.runners.BlockJUnit4ClassRunner.runChild(BlockJUnit4ClassRunner.java:50)
      at org.junit.runners.ParentRunner$3.run(ParentRunner.java:193)
      at org.junit.runners.ParentRunner$1.schedule(ParentRunner.java:52)
      at org.junit.runners.ParentRunner.runChildren(ParentRunner.java:191)
      at org.junit.runners.ParentRunner.access$000(ParentRunner.java:42)
      at org.junit.runners.ParentRunner$2.evaluate(ParentRunner.java:184)
      at org.junit.internal.runners.statements.RunBefores.evaluate(RunBefores.java:28)
      at org.jboss.arquillian.junit.Arquillian$2.evaluate(Arquillian.java:163)
      at org.junit.internal.runners.statements.RunAfters.evaluate(RunAfters.java:31)
      at org.jboss.arquillian.junit.Arquillian$3$1.evaluate(Arquillian.java:186)
      at org.jboss.arquillian.junit.Arquillian$MultiStatementExecutor.execute(Arquillian.java:297)
      at org.jboss.arquillian.junit.Arquillian$3.evaluate(Arquillian.java:182)
      at org.junit.runners.ParentRunner.run(ParentRunner.java:236)
      at org.jboss.arquillian.junit.Arquillian.run(Arquillian.java:127)
      at org.apache.maven.surefire.junit4.JUnit4TestSet.execute(JUnit4TestSet.java:59)
      at org.apache.maven.surefire.suite.AbstractDirectoryTestSuite.executeTestSet(AbstractDirectoryTestSuite.java:115)
      at org.apache.maven.surefire.suite.AbstractDirectoryTestSuite.execute(AbstractDirectoryTestSuite.java:102)
      at org.apache.maven.surefire.Surefire.run(Surefire.java:180)
      at sun.reflect.NativeMethodAccessorImpl.invoke0(Native Method)
      at sun.reflect.NativeMethodAccessorImpl.invoke(Unknown Source)
      at sun.reflect.DelegatingMethodAccessorImpl.invoke(Unknown Source)
      at java.lang.reflect.Method.invoke(Unknown Source)
      at org.apache.maven.surefire.booter.SurefireBooter.runSuitesInProcess(SurefireBooter.java:350)
      at org.apache.maven.surefire.booter.SurefireBooter.main(SurefireBooter.java:1021)

      Attachments

        Activity

          People

            lincolnthree Lincoln Baxter III (Inactive)
            stan8688 stan xi (Inactive)
            Votes:
            0 Vote for this issue
            Watchers:
            3 Start watching this issue

            Dates

              Created:
              Updated:
              Resolved: