Uploaded image for project: 'mod_cluster'
  1. mod_cluster
  2. MODCLUSTER-561

Upgrade maven-war-plugin to version compatible with JDK 9-ea+149 and higher

    XMLWordPrintable

    Details

      Description

      [rhusar@syrah mod_cluster]$ mvn clean install -rf :mod_cluster-demo-server
      [INFO] Scanning for projects...
      [INFO]
      [INFO] ------------------------------------------------------------------------
      [INFO] Building mod_cluster: Demo - Server 2.0.0.Alpha1-SNAPSHOT
      [INFO] ------------------------------------------------------------------------
      [INFO]
      [INFO] --- maven-clean-plugin:3.0.0:clean (default-clean) @ mod_cluster-demo-server ---
      [INFO] Deleting /Users/rhusar/git/mod_cluster/demo/server/target
      [INFO]
      [INFO] --- maven-enforcer-plugin:1.4.1:enforce (enforce-java-version) @ mod_cluster-demo-server ---
      [INFO]
      [INFO] --- maven-enforcer-plugin:1.4.1:enforce (enforce-maven-version) @ mod_cluster-demo-server ---
      [INFO]
      [INFO] --- buildnumber-maven-plugin:1.4:create (get-scm-revision) @ mod_cluster-demo-server ---
      [INFO] Executing: /bin/sh -c cd '/Users/rhusar/git/mod_cluster/demo/server' && 'git' 'rev-parse' '--verify' 'HEAD'
      [INFO] Working directory: /Users/rhusar/git/mod_cluster/demo/server
      [INFO] Storing buildNumber: 28c1db1f598fc45c51d4d0dee45bd9bc4f0788fc at timestamp: 1483363437598
      [INFO] Storing buildScmBranch: MODCLUSTER-560_mockito
      [INFO]
      [INFO] --- maven-resources-plugin:3.0.1:resources (default-resources) @ mod_cluster-demo-server ---
      [INFO] Using 'UTF-8' encoding to copy filtered resources.
      [INFO] skip non existing resourceDirectory /Users/rhusar/git/mod_cluster/demo/server/src/main/resources
      [INFO] Copying 0 resource
      [INFO]
      [INFO] --- maven-compiler-plugin:3.5.1:compile (default-compile) @ mod_cluster-demo-server ---
      [INFO] Changes detected - recompiling the module!
      [INFO] Compiling 9 source files to /Users/rhusar/git/mod_cluster/demo/server/target/classes
      [INFO]
      [INFO] --- maven-resources-plugin:3.0.1:testResources (default-testResources) @ mod_cluster-demo-server ---
      [INFO] Using 'UTF-8' encoding to copy filtered resources.
      [INFO] skip non existing resourceDirectory /Users/rhusar/git/mod_cluster/demo/server/src/test/resources
      [INFO]
      [INFO] --- maven-compiler-plugin:3.5.1:testCompile (default-testCompile) @ mod_cluster-demo-server ---
      [INFO] No sources to compile
      [INFO]
      [INFO] --- maven-surefire-plugin:2.19.1:test (default-test) @ mod_cluster-demo-server ---
      [INFO] No tests to run.
      [INFO]
      [INFO] --- maven-war-plugin:3.0.0:war (default-war) @ mod_cluster-demo-server ---
      [WARNING] Error injecting: org.apache.maven.plugins.war.WarMojo
      com.google.inject.ProvisionException: Unable to provision, see the following errors:
      
      1) Error injecting constructor, java.lang.ExceptionInInitializerError
        at org.apache.maven.plugins.war.WarMojo.<init>(Unknown Source)
        while locating org.apache.maven.plugins.war.WarMojo
      
      1 error
      	at com.google.inject.internal.InjectorImpl$2.get(InjectorImpl.java:1025)
      	at com.google.inject.internal.InjectorImpl.getInstance(InjectorImpl.java:1051)
      	at org.eclipse.sisu.space.AbstractDeferredClass.get(AbstractDeferredClass.java:48)
      	at com.google.inject.internal.ProviderInternalFactory.provision(ProviderInternalFactory.java:81)
      	at com.google.inject.internal.InternalFactoryToInitializableAdapter.provision(InternalFactoryToInitializableAdapter.java:53)
      	at com.google.inject.internal.ProviderInternalFactory$1.call(ProviderInternalFactory.java:65)
      	at com.google.inject.internal.ProvisionListenerStackCallback$Provision.provision(ProvisionListenerStackCallback.java:115)
      	at org.eclipse.sisu.bean.BeanScheduler$Activator.onProvision(BeanScheduler.java:176)
      	at com.google.inject.internal.ProvisionListenerStackCallback$Provision.provision(ProvisionListenerStackCallback.java:126)
      	at com.google.inject.internal.ProvisionListenerStackCallback.provision(ProvisionListenerStackCallback.java:68)
      	at com.google.inject.internal.ProviderInternalFactory.circularGet(ProviderInternalFactory.java:63)
      	at com.google.inject.internal.InternalFactoryToInitializableAdapter.get(InternalFactoryToInitializableAdapter.java:45)
      	at com.google.inject.internal.InjectorImpl$2$1.call(InjectorImpl.java:1016)
      	at com.google.inject.internal.InjectorImpl.callInContext(InjectorImpl.java:1092)
      	at com.google.inject.internal.InjectorImpl$2.get(InjectorImpl.java:1012)
      	at org.eclipse.sisu.inject.Guice4$1.get(Guice4.java:162)
      	at org.eclipse.sisu.inject.LazyBeanEntry.getValue(LazyBeanEntry.java:81)
      	at org.eclipse.sisu.plexus.LazyPlexusBean.getValue(LazyPlexusBean.java:51)
      	at org.codehaus.plexus.DefaultPlexusContainer.lookup(DefaultPlexusContainer.java:263)
      	at org.codehaus.plexus.DefaultPlexusContainer.lookup(DefaultPlexusContainer.java:255)
      	at org.apache.maven.plugin.internal.DefaultMavenPluginManager.getConfiguredMojo(DefaultMavenPluginManager.java:517)
      	at org.apache.maven.plugin.DefaultBuildPluginManager.executeMojo(DefaultBuildPluginManager.java:121)
      	at org.apache.maven.lifecycle.internal.MojoExecutor.execute(MojoExecutor.java:207)
      	at org.apache.maven.lifecycle.internal.MojoExecutor.execute(MojoExecutor.java:153)
      	at org.apache.maven.lifecycle.internal.MojoExecutor.execute(MojoExecutor.java:145)
      	at org.apache.maven.lifecycle.internal.LifecycleModuleBuilder.buildProject(LifecycleModuleBuilder.java:116)
      	at org.apache.maven.lifecycle.internal.LifecycleModuleBuilder.buildProject(LifecycleModuleBuilder.java:80)
      	at org.apache.maven.lifecycle.internal.builder.singlethreaded.SingleThreadedBuilder.build(SingleThreadedBuilder.java:51)
      	at org.apache.maven.lifecycle.internal.LifecycleStarter.execute(LifecycleStarter.java:128)
      	at org.apache.maven.DefaultMaven.doExecute(DefaultMaven.java:307)
      	at org.apache.maven.DefaultMaven.doExecute(DefaultMaven.java:193)
      	at org.apache.maven.DefaultMaven.execute(DefaultMaven.java:106)
      	at org.apache.maven.cli.MavenCli.execute(MavenCli.java:863)
      	at org.apache.maven.cli.MavenCli.doMain(MavenCli.java:288)
      	at org.apache.maven.cli.MavenCli.main(MavenCli.java:199)
      	at java.base/jdk.internal.reflect.NativeMethodAccessorImpl.invoke0(Native Method)
      	at java.base/jdk.internal.reflect.NativeMethodAccessorImpl.invoke(NativeMethodAccessorImpl.java:62)
      	at java.base/jdk.internal.reflect.DelegatingMethodAccessorImpl.invoke(DelegatingMethodAccessorImpl.java:43)
      	at java.base/java.lang.reflect.Method.invoke(Method.java:538)
      	at org.codehaus.plexus.classworlds.launcher.Launcher.launchEnhanced(Launcher.java:289)
      	at org.codehaus.plexus.classworlds.launcher.Launcher.launch(Launcher.java:229)
      	at org.codehaus.plexus.classworlds.launcher.Launcher.mainWithExitCode(Launcher.java:415)
      	at org.codehaus.plexus.classworlds.launcher.Launcher.main(Launcher.java:356)
      Caused by: java.lang.ExceptionInInitializerError
      	at com.thoughtworks.xstream.XStream.setupConverters(XStream.java:832)
      	at com.thoughtworks.xstream.XStream.<init>(XStream.java:574)
      	at com.thoughtworks.xstream.XStream.<init>(XStream.java:496)
      	at com.thoughtworks.xstream.XStream.<init>(XStream.java:465)
      	at com.thoughtworks.xstream.XStream.<init>(XStream.java:411)
      	at com.thoughtworks.xstream.XStream.<init>(XStream.java:378)
      	at org.apache.maven.plugins.war.util.WebappStructureSerializer.<clinit>(WebappStructureSerializer.java:47)
      	at org.apache.maven.plugins.war.AbstractWarMojo.<init>(AbstractWarMojo.java:344)
      	at org.apache.maven.plugins.war.WarMojo.<init>(WarMojo.java:54)
      	at java.base/jdk.internal.reflect.NativeConstructorAccessorImpl.newInstance0(Native Method)
      	at java.base/jdk.internal.reflect.NativeConstructorAccessorImpl.newInstance(NativeConstructorAccessorImpl.java:62)
      	at java.base/jdk.internal.reflect.DelegatingConstructorAccessorImpl.newInstance(DelegatingConstructorAccessorImpl.java:45)
      	at java.base/java.lang.reflect.Constructor.newInstance(Constructor.java:461)
      	at com.google.inject.internal.DefaultConstructionProxyFactory$1.newInstance(DefaultConstructionProxyFactory.java:86)
      	at com.google.inject.internal.ConstructorInjector.provision(ConstructorInjector.java:105)
      	at com.google.inject.internal.ConstructorInjector.access$000(ConstructorInjector.java:32)
      	at com.google.inject.internal.ConstructorInjector$1.call(ConstructorInjector.java:89)
      	at com.google.inject.internal.ProvisionListenerStackCallback$Provision.provision(ProvisionListenerStackCallback.java:115)
      	at com.google.inject.internal.ProvisionListenerStackCallback$Provision.provision(ProvisionListenerStackCallback.java:133)
      	at com.google.inject.internal.ProvisionListenerStackCallback.provision(ProvisionListenerStackCallback.java:68)
      	at com.google.inject.internal.ConstructorInjector.construct(ConstructorInjector.java:87)
      	at com.google.inject.internal.ConstructorBindingImpl$Factory.get(ConstructorBindingImpl.java:267)
      	at com.google.inject.internal.InjectorImpl$2$1.call(InjectorImpl.java:1016)
      	at com.google.inject.internal.InjectorImpl.callInContext(InjectorImpl.java:1103)
      	at com.google.inject.internal.InjectorImpl$2.get(InjectorImpl.java:1012)
      	... 42 more
      Caused by: java.lang.reflect.InaccessibleObjectException: Unable to make field private final java.util.Comparator java.util.TreeMap.comparator accessible: module java.base does not "opens java.util" to unnamed module @6048e26a
      	at java.base/jdk.internal.reflect.Reflection.throwInaccessibleObjectException(Reflection.java:427)
      	at java.base/java.lang.reflect.AccessibleObject.checkCanSetAccessible(AccessibleObject.java:201)
      	at java.base/java.lang.reflect.Field.checkCanSetAccessible(Field.java:171)
      	at java.base/java.lang.reflect.Field.setAccessible(Field.java:165)
      	at com.thoughtworks.xstream.core.util.Fields.locate(Fields.java:40)
      	at com.thoughtworks.xstream.converters.collections.TreeMapConverter.<clinit>(TreeMapConverter.java:50)
      	... 67 more
      [INFO] ------------------------------------------------------------------------
      [INFO] BUILD FAILURE
      [INFO] ------------------------------------------------------------------------
      [INFO] Total time: 2.314 s
      [INFO] Finished at: 2017-01-02T14:23:59+01:00
      [INFO] Final Memory: 21M/70M
      [INFO] ------------------------------------------------------------------------
      [ERROR] Failed to execute goal org.apache.maven.plugins:maven-war-plugin:3.0.0:war (default-war) on project mod_cluster-demo-server: Execution default-war of goal org.apache.maven.plugins:maven-war-plugin:3.0.0:war failed: Unable to load the mojo 'war' in the plugin 'org.apache.maven.plugins:maven-war-plugin:3.0.0' due to an API incompatibility: org.codehaus.plexus.component.repository.exception.ComponentLookupException: null
      [ERROR] -----------------------------------------------------
      [ERROR] realm =    plugin>org.apache.maven.plugins:maven-war-plugin:3.0.0
      [ERROR] strategy = org.codehaus.plexus.classworlds.strategy.SelfFirstStrategy
      [ERROR] urls[0] = file:/Users/rhusar/.m2/repository/org/apache/maven/plugins/maven-war-plugin/3.0.0/maven-war-plugin-3.0.0.jar
      [ERROR] urls[1] = file:/Users/rhusar/.m2/repository/org/codehaus/plexus/plexus-archiver/3.3/plexus-archiver-3.3.jar
      [ERROR] urls[2] = file:/Users/rhusar/.m2/repository/org/apache/commons/commons-compress/1.11/commons-compress-1.11.jar
      [ERROR] urls[3] = file:/Users/rhusar/.m2/repository/org/iq80/snappy/snappy/0.4/snappy-0.4.jar
      [ERROR] urls[4] = file:/Users/rhusar/.m2/repository/org/tukaani/xz/1.5/xz-1.5.jar
      [ERROR] urls[5] = file:/Users/rhusar/.m2/repository/org/codehaus/plexus/plexus-io/2.7.1/plexus-io-2.7.1.jar
      [ERROR] urls[6] = file:/Users/rhusar/.m2/repository/org/sonatype/sisu/sisu-inject-bean/1.4.2/sisu-inject-bean-1.4.2.jar
      [ERROR] urls[7] = file:/Users/rhusar/.m2/repository/org/sonatype/sisu/sisu-guice/2.1.7/sisu-guice-2.1.7-noaop.jar
      [ERROR] urls[8] = file:/Users/rhusar/.m2/repository/org/sonatype/aether/aether-util/1.7/aether-util-1.7.jar
      [ERROR] urls[9] = file:/Users/rhusar/.m2/repository/org/codehaus/plexus/plexus-component-annotations/1.6/plexus-component-annotations-1.6.jar
      [ERROR] urls[10] = file:/Users/rhusar/.m2/repository/org/sonatype/plexus/plexus-sec-dispatcher/1.3/plexus-sec-dispatcher-1.3.jar
      [ERROR] urls[11] = file:/Users/rhusar/.m2/repository/org/sonatype/plexus/plexus-cipher/1.4/plexus-cipher-1.4.jar
      [ERROR] urls[12] = file:/Users/rhusar/.m2/repository/org/apache/maven/maven-archiver/3.1.1/maven-archiver-3.1.1.jar
      [ERROR] urls[13] = file:/Users/rhusar/.m2/repository/org/apache/maven/shared/maven-shared-utils/3.0.1/maven-shared-utils-3.0.1.jar
      [ERROR] urls[14] = file:/Users/rhusar/.m2/repository/commons-io/commons-io/2.5/commons-io-2.5.jar
      [ERROR] urls[15] = file:/Users/rhusar/.m2/repository/org/codehaus/plexus/plexus-interpolation/1.22/plexus-interpolation-1.22.jar
      [ERROR] urls[16] = file:/Users/rhusar/.m2/repository/com/thoughtworks/xstream/xstream/1.4.9/xstream-1.4.9.jar
      [ERROR] urls[17] = file:/Users/rhusar/.m2/repository/xmlpull/xmlpull/1.1.3.1/xmlpull-1.1.3.1.jar
      [ERROR] urls[18] = file:/Users/rhusar/.m2/repository/xpp3/xpp3_min/1.1.4c/xpp3_min-1.1.4c.jar
      [ERROR] urls[19] = file:/Users/rhusar/.m2/repository/org/codehaus/plexus/plexus-utils/3.0.24/plexus-utils-3.0.24.jar
      [ERROR] urls[20] = file:/Users/rhusar/.m2/repository/org/apache/maven/shared/maven-filtering/3.1.1/maven-filtering-3.1.1.jar
      [ERROR] urls[21] = file:/Users/rhusar/.m2/repository/org/sonatype/plexus/plexus-build-api/0.0.7/plexus-build-api-0.0.7.jar
      [ERROR] urls[22] = file:/Users/rhusar/.m2/repository/org/apache/maven/shared/maven-mapping/3.0.0/maven-mapping-3.0.0.jar
      [ERROR] Number of foreign imports: 1
      [ERROR] import: Entry[import  from realm ClassRealm[maven.api, parent: null]]
      [ERROR]
      [ERROR] -----------------------------------------------------: ExceptionInInitializerError: Unable to make field private final java.util.Comparator java.util.TreeMap.comparator accessible: module java.base does not "opens java.util" to unnamed module @6048e26a
      [ERROR] -> [Help 1]
      [ERROR]
      [ERROR] To see the full stack trace of the errors, re-run Maven with the -e switch.
      [ERROR] Re-run Maven using the -X switch to enable full debug logging.
      [ERROR]
      [ERROR] For more information about the errors and possible solutions, please read the following articles:
      [ERROR] [Help 1] http://cwiki.apache.org/confluence/display/MAVEN/PluginContainerException
      

      Upgrading xstream to upstream/master fails with

      [WARNING] Error injecting: org.apache.maven.plugin.war.WarMojo
      com.google.inject.ProvisionException: Unable to provision, see the following errors:
      
      1) Error injecting constructor, java.lang.ExceptionInInitializerError
        at org.apache.maven.plugin.war.WarMojo.<init>(Unknown Source)
        while locating org.apache.maven.plugin.war.WarMojo
      
      1 error
      	at com.google.inject.internal.InjectorImpl$2.get(InjectorImpl.java:1025)
      	at com.google.inject.internal.InjectorImpl.getInstance(InjectorImpl.java:1051)
      	at org.eclipse.sisu.space.AbstractDeferredClass.get(AbstractDeferredClass.java:48)
      	at com.google.inject.internal.ProviderInternalFactory.provision(ProviderInternalFactory.java:81)
      	at com.google.inject.internal.InternalFactoryToInitializableAdapter.provision(InternalFactoryToInitializableAdapter.java:53)
      	at com.google.inject.internal.ProviderInternalFactory$1.call(ProviderInternalFactory.java:65)
      	at com.google.inject.internal.ProvisionListenerStackCallback$Provision.provision(ProvisionListenerStackCallback.java:115)
      	at org.eclipse.sisu.bean.BeanScheduler$Activator.onProvision(BeanScheduler.java:176)
      	at com.google.inject.internal.ProvisionListenerStackCallback$Provision.provision(ProvisionListenerStackCallback.java:126)
      	at com.google.inject.internal.ProvisionListenerStackCallback.provision(ProvisionListenerStackCallback.java:68)
      	at com.google.inject.internal.ProviderInternalFactory.circularGet(ProviderInternalFactory.java:63)
      	at com.google.inject.internal.InternalFactoryToInitializableAdapter.get(InternalFactoryToInitializableAdapter.java:45)
      	at com.google.inject.internal.InjectorImpl$2$1.call(InjectorImpl.java:1016)
      	at com.google.inject.internal.InjectorImpl.callInContext(InjectorImpl.java:1092)
      	at com.google.inject.internal.InjectorImpl$2.get(InjectorImpl.java:1012)
      	at org.eclipse.sisu.inject.Guice4$1.get(Guice4.java:162)
      	at org.eclipse.sisu.inject.LazyBeanEntry.getValue(LazyBeanEntry.java:81)
      	at org.eclipse.sisu.plexus.LazyPlexusBean.getValue(LazyPlexusBean.java:51)
      	at org.codehaus.plexus.DefaultPlexusContainer.lookup(DefaultPlexusContainer.java:263)
      	at org.codehaus.plexus.DefaultPlexusContainer.lookup(DefaultPlexusContainer.java:255)
      	at org.apache.maven.plugin.internal.DefaultMavenPluginManager.getConfiguredMojo(DefaultMavenPluginManager.java:517)
      	at org.apache.maven.plugin.DefaultBuildPluginManager.executeMojo(DefaultBuildPluginManager.java:121)
      	at org.apache.maven.lifecycle.internal.MojoExecutor.execute(MojoExecutor.java:207)
      	at org.apache.maven.lifecycle.internal.MojoExecutor.execute(MojoExecutor.java:153)
      	at org.apache.maven.lifecycle.internal.MojoExecutor.execute(MojoExecutor.java:145)
      	at org.apache.maven.lifecycle.internal.LifecycleModuleBuilder.buildProject(LifecycleModuleBuilder.java:116)
      	at org.apache.maven.lifecycle.internal.LifecycleModuleBuilder.buildProject(LifecycleModuleBuilder.java:80)
      	at org.apache.maven.lifecycle.internal.builder.singlethreaded.SingleThreadedBuilder.build(SingleThreadedBuilder.java:51)
      	at org.apache.maven.lifecycle.internal.LifecycleStarter.execute(LifecycleStarter.java:128)
      	at org.apache.maven.DefaultMaven.doExecute(DefaultMaven.java:307)
      	at org.apache.maven.DefaultMaven.doExecute(DefaultMaven.java:193)
      	at org.apache.maven.DefaultMaven.execute(DefaultMaven.java:106)
      	at org.apache.maven.cli.MavenCli.execute(MavenCli.java:863)
      	at org.apache.maven.cli.MavenCli.doMain(MavenCli.java:288)
      	at org.apache.maven.cli.MavenCli.main(MavenCli.java:199)
      	at java.base/jdk.internal.reflect.NativeMethodAccessorImpl.invoke0(Native Method)
      	at java.base/jdk.internal.reflect.NativeMethodAccessorImpl.invoke(NativeMethodAccessorImpl.java:62)
      	at java.base/jdk.internal.reflect.DelegatingMethodAccessorImpl.invoke(DelegatingMethodAccessorImpl.java:43)
      	at java.base/java.lang.reflect.Method.invoke(Method.java:538)
      	at org.codehaus.plexus.classworlds.launcher.Launcher.launchEnhanced(Launcher.java:289)
      	at org.codehaus.plexus.classworlds.launcher.Launcher.launch(Launcher.java:229)
      	at org.codehaus.plexus.classworlds.launcher.Launcher.mainWithExitCode(Launcher.java:415)
      	at org.codehaus.plexus.classworlds.launcher.Launcher.main(Launcher.java:356)
      Caused by: java.lang.ExceptionInInitializerError
      	at org.apache.maven.plugin.war.AbstractWarMojo.<init>(AbstractWarMojo.java:329)
      	at org.apache.maven.plugin.war.WarMojo.<init>(WarMojo.java:54)
      	at java.base/jdk.internal.reflect.NativeConstructorAccessorImpl.newInstance0(Native Method)
      	at java.base/jdk.internal.reflect.NativeConstructorAccessorImpl.newInstance(NativeConstructorAccessorImpl.java:62)
      	at java.base/jdk.internal.reflect.DelegatingConstructorAccessorImpl.newInstance(DelegatingConstructorAccessorImpl.java:45)
      	at java.base/java.lang.reflect.Constructor.newInstance(Constructor.java:461)
      	at com.google.inject.internal.DefaultConstructionProxyFactory$1.newInstance(DefaultConstructionProxyFactory.java:86)
      	at com.google.inject.internal.ConstructorInjector.provision(ConstructorInjector.java:105)
      	at com.google.inject.internal.ConstructorInjector.access$000(ConstructorInjector.java:32)
      	at com.google.inject.internal.ConstructorInjector$1.call(ConstructorInjector.java:89)
      	at com.google.inject.internal.ProvisionListenerStackCallback$Provision.provision(ProvisionListenerStackCallback.java:115)
      	at com.google.inject.internal.ProvisionListenerStackCallback$Provision.provision(ProvisionListenerStackCallback.java:133)
      	at com.google.inject.internal.ProvisionListenerStackCallback.provision(ProvisionListenerStackCallback.java:68)
      	at com.google.inject.internal.ConstructorInjector.construct(ConstructorInjector.java:87)
      	at com.google.inject.internal.ConstructorBindingImpl$Factory.get(ConstructorBindingImpl.java:267)
      	at com.google.inject.internal.InjectorImpl$2$1.call(InjectorImpl.java:1016)
      	at com.google.inject.internal.InjectorImpl.callInContext(InjectorImpl.java:1103)
      	at com.google.inject.internal.InjectorImpl$2.get(InjectorImpl.java:1012)
      	... 42 more
      Caused by: java.lang.NullPointerException
      	at com.thoughtworks.xstream.mapper.ClassAliasingMapper.addClassAlias(ClassAliasingMapper.java:37)
      	at com.thoughtworks.xstream.XStream.alias(XStream.java:1175)
      	at com.thoughtworks.xstream.XStream.setupAliases(XStream.java:733)
      	at com.thoughtworks.xstream.XStream.<init>(XStream.java:552)
      	at com.thoughtworks.xstream.XStream.<init>(XStream.java:478)
      	at com.thoughtworks.xstream.XStream.<init>(XStream.java:471)
      	at com.thoughtworks.xstream.XStream.<init>(XStream.java:416)
      	at com.thoughtworks.xstream.XStream.<init>(XStream.java:400)
      	at com.thoughtworks.xstream.XStream.<init>(XStream.java:388)
      	at org.apache.maven.plugin.war.util.WebappStructureSerializer.<clinit>(WebappStructureSerializer.java:47)
      	... 60 more
      

        Attachments

          Issue Links

            Activity

              People

              Assignee:
              rhusar Radoslav Husar
              Reporter:
              rhusar Radoslav Husar
              Votes:
              0 Vote for this issue
              Watchers:
              1 Start watching this issue

                Dates

                Created:
                Updated:
                Resolved: