Details

    • Type: Bug
    • Status: Closed (View Workflow)
    • Priority: Major
    • Resolution: Done
    • Affects Version/s: None
    • Fix Version/s: 1.0-alpha-3
    • Component/s: None
    • Labels:
      None

      Description

      modules:
           [echo] Initializing module -> net.iharder.base64
          [mkdir] Created dir: /home/st/dev/keycloak/distribution/modules/target/modules/net/iharder.base64/main
      [INFO] ------------------------------------------------------------------------
      [INFO] Reactor Summary:
      [INFO] 
      [INFO] Keycloak JBoss Modules ............................ FAILURE [  8.903 s]
      [INFO] Keycloak AS7 Adapter Distro ....................... SKIPPED
      [INFO] Keycloak EAP6 Adapter Distro ...................... SKIPPED
      [INFO] Keycloak Wildfly Adapter Distro ................... SKIPPED
      [INFO] Keycloak Examples and Doc Distribution ............ SKIPPED
      [INFO] Keycloak Example Themes ........................... SKIPPED
      [INFO] Keycloak WAR Deployment For Wildfly/AS7/EAP ....... SKIPPED
      [INFO] Keycloak WAR Distribution ......................... SKIPPED
      [INFO] Keycloak Appliance Distribution ................... SKIPPED
      [INFO] Keycloak Source Distribution ...................... SKIPPED
      [INFO] Distribution ...................................... SKIPPED
      [INFO] ------------------------------------------------------------------------
      [INFO] BUILD FAILURE
      [INFO] ------------------------------------------------------------------------
      [INFO] Total time: 9.166 s
      [INFO] Finished at: 2014-03-10T17:49:01+00:00
      [INFO] Final Memory: 30M/153M
      [INFO] ------------------------------------------------------------------------
      [ERROR] Failed to execute goal org.apache.maven.plugins:maven-antrun-plugin:1.7:run (build-dist) on project keycloak-jboss-modules: An Ant BuildException has occured: The following error occurred while executing this line:
      [ERROR] /home/st/dev/keycloak/distribution/modules/build.xml:30: The following error occurred while executing this line:
      [ERROR] /home/st/dev/keycloak/distribution/modules/build.xml:46: The following error occurred while executing this line:
      [ERROR] /home/st/dev/keycloak/distribution/modules/lib.xml:47: /home/st/dev/keycloak/distribution/modules/src/main/resources/modules/net/iharder.base64/main does not exist.
      [ERROR] around Ant part ...<ant antfile="build.xml" inheritRefs="true">... @ 4:47 in /home/st/dev/keycloak/distribution/modules/target/antrun/build-main.xml
      [ERROR] -> [Help 1]
      [ERROR] 
      [ERROR] To see the full stack trace of the errors, re-run Maven with the -e switch.
      [ERROR] Re-run Maven using the -X switch to enable full debug logging.
      [ERROR] 
      [ERROR] For more information about the errors and possible solutions, please read the following articles:
      [ERROR] [Help 1] http://cwiki.apache.org/confluence/display/MAVEN/MojoExecutionException
      

        Gliffy Diagrams

          Attachments

            Activity

              People

              • Assignee:
                stianst Stian Thorgersen
                Reporter:
                stianst Stian Thorgersen
              • Votes:
                1 Vote for this issue
                Watchers:
                3 Start watching this issue

                Dates

                • Created:
                  Updated:
                  Resolved: