Uploaded image for project: 'Keycloak'
  1. Keycloak
  2. KEYCLOAK-17905

Quarkus: ClientPoliciesImportExportTest.testSingleFileRealmExportImport failed in GHA

    XMLWordPrintable

    Details

    • Docs QE Status:
      NEW
    • QE Status:
      NEW

      Description

      https://github.com/keycloak/keycloak/pull/7978/checks?check_run_id=2457372404

      ClientPoliciesImportExportTest ++ 12:40:37,935 INFO  [org.keycloak.testsuite.client.ClientPoliciesImportExportTest] [ClientPoliciesImportExportTest] testSingleFileRealmExportImport() STARTED
      ClientPoliciesImportExportTest ++ 12:40:37,958 INFO  [org.keycloak.testsuite.drone.KeycloakDronePostSetup] Configuring driver settings. implicitWait=1500, pageLoadTimeout=10000
      ClientPoliciesImportExportTest ++ 12:40:38,378 INFO  [org.keycloak.testsuite.client.ClientPoliciesImportExportTest] removing realm: demorealm
      ClientPoliciesImportExportTest ++ 12:40:38,637 DEBUG [org.keycloak.testsuite.client.ClientPoliciesImportExportTest] loading test realms
      ClientPoliciesImportExportTest ++ 12:40:38,638 INFO  [org.keycloak.testsuite.client.ClientPoliciesImportExportTest] importing test realms
      ClientPoliciesImportExportTest ++ 12:40:38,638 DEBUG [org.keycloak.testsuite.client.ClientPoliciesImportExportTest] --importing realm: test
      ClientPoliciesImportExportTest ++ 12:40:40,767 INFO  [org.keycloak.testsuite.client.ClientPoliciesImportExportTest] removing test realms after test method
      ClientPoliciesImportExportTest ++ 12:40:40,768 INFO  [org.keycloak.testsuite.client.ClientPoliciesImportExportTest] removing realm: test
      ClientPoliciesImportExportTest ++ 12:40:41,247 ERROR [org.keycloak.testsuite.client.ClientPoliciesImportExportTest] [ClientPoliciesImportExportTest] testSingleFileRealmExportImport() FAILED
      ClientPoliciesImportExportTest ++ 12:40:41,247 INFO  [org.keycloak.testsuite.client.ClientPoliciesImportExportTest] [ClientPoliciesImportExportTest] testSingleFileRealmExportImport() FINISHED
      ClientPoliciesImportExportTest ++ 
      ClientPoliciesImportExportTest ++ 
      
      --------- org.keycloak.testsuite.client.ClientPoliciesImportExportTest output end  ---------
      Error:  Tests run: 1, Failures: 0, Errors: 1, Skipped: 0, Time elapsed: 4.538 s <<< FAILURE! - in org.keycloak.testsuite.client.ClientPoliciesImportExportTest
      Error: OR] testSingleFileRealmExportImport(org.keycloak.testsuite.client.ClientPoliciesImportExportTest)  Time elapsed: 3.312 s  <<< ERROR!
      -- javax.ws.rs.InternalServerErrorException: HTTP 500 Internal Server Error
      -- 	at org.jboss.resteasy.client.jaxrs.internal.ClientInvocation.handleErrorStatus(ClientInvocation.java:234)
      -- 	at org.jboss.resteasy.client.jaxrs.internal.proxy.extractors.DefaultEntityExtractorFactory$3.extractEntity(DefaultEntityExtractorFactory.java:50)
      -- 	at org.jboss.resteasy.client.jaxrs.internal.proxy.ClientInvoker.invokeSync(ClientInvoker.java:151)
      -- 	at org.jboss.resteasy.client.jaxrs.internal.proxy.ClientInvoker.invoke(ClientInvoker.java:112)
      -- 	at org.jboss.resteasy.client.jaxrs.internal.proxy.ClientProxy.invoke(ClientProxy.java:76)
      -- 	at com.sun.proxy.$Proxy120.runExport(Unknown Source)
      -- 	at org.keycloak.testsuite.client.ClientPoliciesImportExportTest.testRealmExportImport(ClientPoliciesImportExportTest.java:79)
      -- 	at org.keycloak.testsuite.client.ClientPoliciesImportExportTest.testSingleFileRealmExportImport(ClientPoliciesImportExportTest.java:72)
      -- 	at sun.reflect.NativeMethodAccessorImpl.invoke0(Native Method)
      -- 	at sun.reflect.NativeMethodAccessorImpl.invoke(NativeMethodAccessorImpl.java:62)
      -- 	at sun.reflect.DelegatingMethodAccessorImpl.invoke(DelegatingMethodAccessorImpl.java:43)
      -- 	at java.lang.reflect.Method.invoke(Method.java:498)
      -- 	at org.junit.runners.model.FrameworkMethod$1.runReflectiveCall(FrameworkMethod.java:59)
      -- 	at org.junit.internal.runners.model.ReflectiveCallable.run(ReflectiveCallable.java:12)
      -- 	at org.junit.runners.model.FrameworkMethod.invokeExplosively(FrameworkMethod.java:56)
      -- 	at org.jboss.arquillian.junit.Arquillian$8$1.invokeMethod(Arquillian.java:325)
      -- 	at org.jboss.arquillian.junit.MethodInvoker$1.invoke(MethodInvoker.java:18)
      -- 	at org.jboss.arquillian.container.test.impl.execution.LocalTestExecuter.execute(LocalTestExecuter.java:57)
      -- 	at org.keycloak.testsuite.arquillian.ModelTestExecutor.execute(ModelTestExecutor.java:49)
      -- 	at sun.reflect.GeneratedMethodAccessor201.invoke(Unknown Source)
      -- 	at sun.reflect.DelegatingMethodAccessorImpl.invoke(DelegatingMethodAccessorImpl.java:43)
      -- 	at java.lang.reflect.Method.invoke(Method.java:498)
      -- 	at org.jboss.arquillian.core.impl.ObserverImpl.invoke(ObserverImpl.java:86)
      -- 	at org.jboss.arquillian.core.impl.EventContextImpl.invokeObservers(EventContextImpl.java:103)
      -- 	at org.jboss.arquillian.core.impl.EventContextImpl.proceed(EventContextImpl.java:90)
      -- 	at org.jboss.arquillian.core.impl.ManagerImpl.fire(ManagerImpl.java:133)
      -- 	at org.jboss.arquillian.core.impl.ManagerImpl.fire(ManagerImpl.java:105)
      -- 	at org.jboss.arquillian.core.impl.EventImpl.fire(EventImpl.java:62)
      -- 	at org.jboss.arquillian.container.test.impl.execution.ClientTestExecuter.execute(ClientTestExecuter.java:50)
      -- 	at org.jboss.arquillian.container.test.impl.client.ContainerEventController.createBeforeContext(ContainerEventController.java:114)
      -- 	at sun.reflect.GeneratedMethodAccessor9.invoke(Unknown Source)
      -- 	at sun.reflect.DelegatingMethodAccessorImpl.invoke(DelegatingMethodAccessorImpl.java:43)
      -- 	at java.lang.reflect.Method.invoke(Method.java:498)
      -- 	at org.jboss.arquillian.core.impl.ObserverImpl.invoke(ObserverImpl.java:86)
      -- 	at org.jboss.arquillian.core.impl.EventContextImpl.proceed(EventContextImpl.java:95)
      -- 	at org.jboss.arquillian.test.impl.TestContextHandler.createTestContext(TestContextHandler.java:116)
      -- 	at sun.reflect.GeneratedMethodAccessor6.invoke(Unknown Source)
      -- 	at sun.reflect.DelegatingMethodAccessorImpl.invoke(DelegatingMethodAccessorImpl.java:43)
      -- 	at java.lang.reflect.Method.invoke(Method.java:498)
      -- 	at org.jboss.arquillian.core.impl.ObserverImpl.invoke(ObserverImpl.java:86)
      -- 	at org.jboss.arquillian.core.impl.EventContextImpl.proceed(EventContextImpl.java:95)
      -- 	at org.jboss.arquillian.test.impl.TestContextHandler.createClassContext(TestContextHandler.java:83)
      -- 	at sun.reflect.GeneratedMethodAccessor5.invoke(Unknown Source)
      -- 	at sun.reflect.DelegatingMethodAccessorImpl.invoke(DelegatingMethodAccessorImpl.java:43)
      -- 	at java.lang.reflect.Method.invoke(Method.java:498)
      -- 	at org.jboss.arquillian.core.impl.ObserverImpl.invoke(ObserverImpl.java:86)
      -- 	at org.jboss.arquillian.core.impl.EventContextImpl.proceed(EventContextImpl.java:95)
      -- 	at org.jboss.arquillian.test.impl.TestContextHandler.createSuiteContext(TestContextHandler.java:69)
      -- 	at sun.reflect.GeneratedMethodAccessor4.invoke(Unknown Source)
      -- 	at sun.reflect.DelegatingMethodAccessorImpl.invoke(DelegatingMethodAccessorImpl.java:43)
      -- 	at java.lang.reflect.Method.invoke(Method.java:498)
      -- 	at org.jboss.arquillian.core.impl.ObserverImpl.invoke(ObserverImpl.java:86)
      -- 	at org.jboss.arquillian.core.impl.EventContextImpl.proceed(EventContextImpl.java:95)
      -- 	at org.jboss.arquillian.core.impl.ManagerImpl.fire(ManagerImpl.java:133)
      -- 	at org.jboss.arquillian.core.impl.ManagerImpl.fire(ManagerImpl.java:105)
      -- 	at org.jboss.arquillian.test.impl.EventTestRunnerAdaptor.fireCustomLifecycle(EventTestRunnerAdaptor.java:159)
      -- 	at org.jboss.arquillian.junit.Arquillian$7.evaluate(Arquillian.java:273)
      -- 	at org.junit.runners.BlockJUnit4ClassRunner$1.evaluate(BlockJUnit4ClassRunner.java:100)
      -- 	at org.junit.runners.ParentRunner.runLeaf(ParentRunner.java:366)
      -- 	at org.junit.runners.BlockJUnit4ClassRunner.runChild(BlockJUnit4ClassRunner.java:103)
      -- 	at org.junit.runners.BlockJUnit4ClassRunner.runChild(BlockJUnit4ClassRunner.java:63)
      -- 	at org.junit.runners.ParentRunner$4.run(ParentRunner.java:331)
      -- 	at org.junit.runners.ParentRunner$1.schedule(ParentRunner.java:79)
      -- 	at org.junit.runners.ParentRunner.runChildren(ParentRunner.java:329)
      -- 	at org.junit.runners.ParentRunner.access$100(ParentRunner.java:66)
      -- 	at org.junit.runners.ParentRunner$2.evaluate(ParentRunner.java:293)
      -- 	at org.jboss.arquillian.junit.Arquillian$2.evaluate(Arquillian.java:166)
      -- 	at org.jboss.arquillian.junit.Arquillian.multiExecute(Arquillian.java:350)
      -- 	at org.jboss.arquillian.junit.Arquillian.access$200(Arquillian.java:54)
      -- 	at org.jboss.arquillian.junit.Arquillian$3.evaluate(Arquillian.java:177)
      -- 	at org.junit.runners.ParentRunner$3.evaluate(ParentRunner.java:306)
      -- 	at org.junit.runners.ParentRunner.run(ParentRunner.java:413)
      -- 	at org.jboss.arquillian.junit.Arquillian.run(Arquillian.java:115)
      -- 	at org.apache.maven.surefire.junit4.JUnit4Provider.execute(JUnit4Provider.java:365)
      -- 	at org.apache.maven.surefire.junit4.JUnit4Provider.executeWithRerun(JUnit4Provider.java:273)
      -- 	at org.apache.maven.surefire.junit4.JUnit4Provider.executeTestSet(JUnit4Provider.java:238)
      -- 	at org.apache.maven.surefire.junit4.JUnit4Provider.invoke(JUnit4Provider.java:159)
      -- 	at org.apache.maven.surefire.booter.ForkedBooter.invokeProviderInSameClassLoader(ForkedBooter.java:384)
      -- 	at org.apache.maven.surefire.booter.ForkedBooter.runSuitesInProcess(ForkedBooter.java:345)
      -- 	at org.apache.maven.surefire.booter.ForkedBooter.execute(ForkedBooter.java:126)
      -- 	at org.apache.maven.surefire.booter.ForkedBooter.main(ForkedBooter.java:418)
      

      https://github.com/keycloak/keycloak/pull/7978/checks?check_run_id=2457372404

        Attachments

          Issue Links

            Activity

              People

              Assignee:
              vmuzikar Václav Muzikář
              Reporter:
              hmlnarik Hynek Mlnařík
              Votes:
              0 Vote for this issue
              Watchers:
              2 Start watching this issue

                Dates

                Created:
                Updated:
                Resolved: