Uploaded image for project: 'JBoss Enterprise Application Platform 6'
  1. JBoss Enterprise Application Platform 6
  2. JBPAPP6-671

EAP 6 runtime failure w/ IBM JDK 1.6 due to old STaX - missing javax.xml.stream.XMLOutputFactory

    Details

      Description

      This will be rerun for ER4 but craeting a jira as discussed with Ondra

      I built the eap testsuite on Oracle JDK6 and tried to run it on IBM JDKK 1.6
      However i see following build failure:

      Failed to execute goal org.apache.maven.plugins:maven-compiler-plugin:2.3.2-redhat-1:compile (default-compile) on project jboss-as-testsuite-shared: Compilation failure
      [ERROR] /mnt/hudson_workspace/workspace/eap-60-as-testsuite-RHEL6-buildoracleJDK6_testrunIBMJDK16/jboss-eap/testsuite/shared/src/main/java/org/jboss/as/test/integration/management/base/AbstractMgmtTestBase.java:[207,95] cannot find symbol
      [ERROR] symbol : method newFactory()
      [ERROR] location: class javax.xml.stream.XMLOutputFactory
      [ERROR] -> [Help 1]

      Hudson job link:

      http://hudson.qa.jboss.com/hudson/view/EAP6/view/EAP6-AS-Testsuite/job/eap-60-as-testsuite-RHEL6-buildoracleJDK6_testrunIBMJDK16/6/consoleText

      I get positive results(successful build failing only at integration-benchmark for ER3) when I run the same configuration on Oracle JDK 1.6 (i.e mvn install on Oracle JDK 16 followed by mvn test on Oracle JDK16)

        Gliffy Diagrams

          Attachments

            Issue Links

              Activity

                People

                • Assignee:
                  heiko.braun Heiko Braun
                  Reporter:
                  madhumita12 Madhumita Sadhukhan
                • Votes:
                  0 Vote for this issue
                  Watchers:
                  5 Start watching this issue

                  Dates

                  • Created:
                    Updated:
                    Resolved: