Uploaded image for project: 'Infinispan'
  1. Infinispan
  2. ISPN-9931

infinispan-protocol-parser-generator-maven-plugin is breaking the build on Windows - character to be escaped is missing

    Details

    • Type: Bug
    • Status: Closed (View Workflow)
    • Priority: Critical
    • Resolution: Done
    • Affects Version/s: 10.0.0.Alpha3, 9.4.6.Final
    • Fix Version/s: 9.4.7.Final, 10.0.0.Beta1
    • Component/s: None
    • Labels:
      None

      Description

      Once JDG-2400 was fixed the build continued but now we have a new issue:

      [INFO] Transforming C:\home\jenkins\workspace\jdg-func-ispn-testsuite-windows-os\11c13a93\infinispan\server\hotrod\src\main\resources\hotrod.gr...
      [INFO] ------------------------------------------------------------------------
      [INFO] Reactor Summary for Infinispan Common Parent 9.4.6.Final-redhat-00001:
      [INFO] 
      [INFO] Infinispan Common Parent ........................... SUCCESS [  6.916 s]
      [INFO] Infinispan BOM ..................................... SUCCESS [  1.372 s]
      [INFO] Infinispan Checkstyle Rules ........................ SUCCESS [ 21.703 s]
      [INFO] Infinispan Common Parent ........................... SUCCESS [ 31.895 s]
      [INFO] Infinispan Commons Test Dependencies ............... SUCCESS [ 18.235 s]
      [INFO] Infinispan Commons ................................. SUCCESS [01:14 min]
      [INFO] Infinispan Defaults Maven Plugin ................... SUCCESS [ 26.444 s]
      [INFO] Protocol Parser Generator Maven Plugin ............. SUCCESS [ 14.373 s]
      [INFO] Infinispan Core .................................... SUCCESS [01:40 min]
      [INFO] Infinispan Cloud ................................... SUCCESS [  2.196 s]
      [INFO] Infinispan Extended Statistics ..................... SUCCESS [ 23.333 s]
      [INFO] Infinispan Clustered Counter ....................... SUCCESS [ 24.592 s]
      [INFO] Infinispan Multimap ................................ SUCCESS [ 19.955 s]
      [INFO] Infinispan Cache Stores ............................ SUCCESS [  1.675 s]
      [INFO] Infinispan JDBC CacheStore ......................... SUCCESS [ 37.638 s]
      [INFO] Infinispan JPA CacheStore .......................... SUCCESS [ 31.118 s]
      [INFO] Infinispan RocksDB CacheStore ...................... SUCCESS [ 27.789 s]
      [INFO] Infinispan LevelDB CacheStore ...................... SUCCESS [ 24.133 s]
      [INFO] Infinispan Query DSL API ........................... SUCCESS [ 18.304 s]
      [INFO] Infinispan Object Querying and Filtering API ....... SUCCESS [ 35.628 s]
      [INFO] Parent pom for the Lucene integration modules ...... SUCCESS [  1.680 s]
      [INFO] Infinispan Lucene Directory Implementation ......... SUCCESS [ 25.087 s]
      [INFO] Infinispan Directory Provider for Hibernate Search . SUCCESS [ 26.153 s]
      [INFO] Infinispan Query ................................... SUCCESS [ 37.329 s]
      [INFO] Infinispan Remote Query Client ..................... SUCCESS [ 18.815 s]
      [INFO] Infinispan Tasks API ............................... SUCCESS [ 10.826 s]
      [INFO] Infinispan Task Manager ............................ SUCCESS [ 18.700 s]
      [INFO] Parent pom for server modules ...................... SUCCESS [  1.620 s]
      [INFO] Infinispan Server - Core Components ................ SUCCESS [ 32.959 s]
      [INFO] Infinispan Remote Query Server ..................... SUCCESS [ 25.946 s]
      [INFO] Infinispan Scripting ............................... SUCCESS [ 23.053 s]
      [INFO] Infinispan Hot Rod Server .......................... FAILURE [  1.612 s]
      [INFO] Infinispan Hot Rod Client .......................... SKIPPED
      [INFO] Infinispan Remote CacheStore ....................... SKIPPED
      [INFO] Infinispan REST Server ............................. SKIPPED
      [INFO] Infinispan REST CacheStore ......................... SKIPPED
      [INFO] Infinispan Soft-Index CacheStore ................... SKIPPED
      [INFO] Infinispan Tools ................................... SKIPPED
      [INFO] Infinispan Tree API ................................ SKIPPED
      [INFO] Infinispan CLI Client .............................. SKIPPED
      [INFO] Infinispan Memcached Server ........................ SKIPPED
      [INFO] Infinispan CLI Interpreter ......................... SKIPPED
      [INFO] Infinispan Command Line Interface persistence ...... SKIPPED
      [INFO] Infinispan Multi Tenant Router ..................... SKIPPED
      [INFO] Infinispan Atomic Factory .......................... SKIPPED
      [INFO] Parent pom for uberjar modules ..................... SKIPPED
      [INFO] Infinispan CDI support parent ...................... SKIPPED
      [INFO] Infinispan CDI support common ...................... SKIPPED
      [INFO] Infinispan CDI remote support ...................... SKIPPED
      [INFO] Infinispan JCACHE (JSR-107) Parent ................. SKIPPED
      [INFO] Infinispan JCACHE (JSR-107) Common Components ...... SKIPPED
      [INFO] Infinispan JCACHE (JSR-107) Remote Implementation .. SKIPPED
      [INFO] Infinispan Remote Client ........................... SKIPPED
      [INFO] Infinispan CDI embedded support .................... SKIPPED
      [INFO] Infinispan JCACHE (JSR-107) Embedded Implementation  SKIPPED
      [INFO] Infinispan Embedded ................................ SKIPPED
      [INFO] Infinispan Embedded Query .......................... SKIPPED
      [INFO] Infinispan CLI ..................................... SKIPPED
      [INFO] Infinispan OSGi Service ............................ SKIPPED
      [INFO] Infinispan Spring 4 support ........................ SKIPPED
      [INFO] Infinispan Spring 4 Common module .................. SKIPPED
      [INFO] Infinispan Spring 4 Embedded support ............... SKIPPED
      [INFO] Infinispan Spring 4 Remote support ................. SKIPPED
      [INFO] Infinispan Spring 5 support ........................ SKIPPED
      [INFO] Infinispan Spring 5 Common module .................. SKIPPED
      [INFO] Infinispan Spring 5 Embedded support ............... SKIPPED
      [INFO] Infinispan Spring 5 Remote support ................. SKIPPED
      [INFO] Infinispan GUI Demo ................................ SKIPPED
      [INFO] Infinispan Clustered Lock .......................... SKIPPED
      [INFO] Infinispan Wildfly Feature Pack .................... SKIPPED
      [INFO] Infinispan Wildfly Feature Pack - Commons .......... SKIPPED
      [INFO] Infinispan Wildfly Feature Pack - Client ........... SKIPPED
      [INFO] Infinispan Wildfly Feature Pack - Embedded ......... SKIPPED
      [INFO] Infinispan Wildfly Feature Pack - Embedded Query ... SKIPPED
      [INFO] Infinispan Server - BOM ............................ SKIPPED
      [INFO] Infinispan Server - Command line interface ......... SKIPPED
      [INFO] Infinispan Server - Commons ........................ SKIPPED
      [INFO] Infinispan Server - JGroups Subsystem .............. SKIPPED
      [INFO] Infinispan Server - Event Logger ................... SKIPPED
      [INFO] Infinispan Server - Infinispan Subsystem ........... SKIPPED
      [INFO] Infinispan Server - Endpoints Subsystem ............ SKIPPED
      [INFO] Infinispan Wildfly Feature Pack - Server ........... SKIPPED
      [INFO] Infinispan Wildfly Feature Pack - Wildfly Modules .. SKIPPED
      [INFO] Infinispan Server - Feature Pack ................... SKIPPED
      [INFO] Infinispan Server - Build .......................... SKIPPED
      [INFO] Infinispan Integration Tests Parent ................ SKIPPED
      [INFO] Integration tests - Security Tests ................. SKIPPED
      [INFO] Infinispan Server - Test Suite ..................... SKIPPED
      [INFO] Infinispan Server .................................. SKIPPED
      [INFO] Infinispan JCACHE (JSR-107) TCK Runner ............. SKIPPED
      [INFO] Integration tests - Wildfly Module Integration Tests SKIPPED
      [INFO] Integration tests - AS Lucene Directory ............ SKIPPED
      [INFO] Integration tests - Endpoints interop .............. SKIPPED
      [INFO] Integration tests - CDI/JCache interactions ........ SKIPPED
      [INFO] Integration tests - SecurityManager tests .......... SKIPPED
      [INFO] Infinispan Hibernate Parent ........................ SKIPPED
      [INFO] Infinispan Hibernate Cache SPI ..................... SKIPPED
      [INFO] Infinispan Hibernate Cache Commons ................. SKIPPED
      [INFO] Infinispan Hibernate 5.3 Cache ..................... SKIPPED
      [INFO] Integration tests - OSGi/Karaf ..................... SKIPPED
      [INFO] Integration tests - Elasticsearch IndexManager ..... SKIPPED
      [INFO] Integration tests - Weld SE CDI tests .............. SKIPPED
      [INFO] Infinispan Embedded Integration Tests .............. SKIPPED
      [INFO] Infinispan Embedded Query Integration Tests ........ SKIPPED
      [INFO] Infinispan Remote Client Integration Tests ......... SKIPPED
      [INFO] Integration tests - Spring Boot .................... SKIPPED
      [INFO] Integration tests - Spring Boot 2 .................. SKIPPED
      [INFO] Alternative client marshallers ..................... SKIPPED
      [INFO] Infinispan Common Marshaller Test Classes .......... SKIPPED
      [INFO] Infinispan Kryo Marshaller Bridge .................. SKIPPED
      [INFO] Infinispan Kryo Marshaller Bridge Bundle ........... SKIPPED
      [INFO] Infinispan Protostuff Marshaller Bridge ............ SKIPPED
      [INFO] Infinispan Protostuff Marshaller Bridge Bundle ..... SKIPPED
      [INFO] Infinispan Hibernate 5.1 Cache ..................... SKIPPED
      [INFO] ------------------------------------------------------------------------
      [INFO] BUILD FAILURE
      [INFO] ------------------------------------------------------------------------
      [INFO] Total time:  13:19 min
      [INFO] Finished at: 2019-01-28T19:20:52Z
      [INFO] ------------------------------------------------------------------------
      [ERROR] Failed to execute goal org.infinispan:infinispan-protocol-parser-generator-maven-plugin:9.4.6.Final-redhat-00001:generate (default) on project infinispan-server-hotrod: Execution default of goal org.infinispan:infinispan-protocol-parser-generator-maven-plugin:9.4.6.Final-redhat-00001:generate failed: character to be escaped is missing -> [Help 1]
      [ERROR] 
      [ERROR] To see the full stack trace of the errors, re-run Maven with the -e switch.
      [ERROR] Re-run Maven using the -X switch to enable full debug logging.
      [ERROR] 
      [ERROR] For more information about the errors and possible solutions, please read the following articles:
      [ERROR] [Help 1] http://cwiki.apache.org/confluence/display/MAVEN/PluginExecutionException
      [ERROR] 
      [ERROR] After correcting the problems, you can resume the build with the command
      [ERROR]   mvn <goals> -rf :infinispan-server-hotrod
      Picked up JAVA_TOOL_OPTIONS: -Dfile.encoding=UTF8 -Djboss.modules.system.pkgs=com.sun.crypto.provider
      + TMP_RESULT=1
      + [[ 1 != 0 ]]
      + echo 'JDG_TEAM: Ooops, maven build failed(infinispan testsuite). Investigate errors in jenkins console output'
      JDG_TEAM: Ooops, maven build failed(infinispan testsuite). Investigate errors in jenkins console output
      + exit 1
      Build step 'Execute shell' marked build as failure
      Archiving artifacts
      Recording test results
      There are no artifacts from this build for Panda to use as input.
      Started calculate disk usage of build
      Finished Calculation of disk usage of build in 0 seconds
      Started calculate disk usage of workspace
      Finished Calculation of disk usage of workspace in  3 second
      Finished: FAILURE
      

        Gliffy Diagrams

          Attachments

            Issue Links

              Activity

                People

                • Assignee:
                  NadirX Tristan Tarrant
                  Reporter:
                  NadirX Tristan Tarrant
                • Votes:
                  0 Vote for this issue
                  Watchers:
                  1 Start watching this issue

                  Dates

                  • Created:
                    Updated:
                    Resolved: