Uploaded image for project: 'Red Hat Fuse'
  1. Red Hat Fuse
  2. ENTESB-10884

syndesis aligned to camel-k-runtime 0.3.3, Fuse aligned to 0.3.4

    Details

    • Type: Bug
    • Status: Closed
    • Priority: Blocker
    • Resolution: Done
    • Affects Version/s: fuse-7.4-GA
    • Fix Version/s: fuse-7.4-GA
    • Component/s: Fuse Online
    • Labels:
      None

      Description

      Getting some errors on a missing artifact from camel-k-runtime in the syndesis 1.7.3 tag. My guess here is that there were changes between camel-k-runtime 0.3.3 and 0.3.4 that need fixes in syndesis for - the artifact missing below does not seem to be built in 0.3.4. I'm not sure if that's a build problem or a difference between 0.3.3 and 0.3.4

      https://fusesource-jenkins.rhev-ci-vms.eng.rdu2.redhat.com/job/ipaas-7.4/22/console

      [INFO] Integration :: Runtime :: Camel-k .................. FAILURE [01:01 min]
      [INFO] Integration :: Camel K :: Bill of Materials (BOM) .. SKIPPED
      [INFO] Integration :: Runtime :: SpringBoot ............... SKIPPED
      [INFO] Connector .......................................... SKIPPED
      [INFO] Connector :: Support :: Util ....................... SKIPPED
      [INFO] Connector :: Support :: Verifier ................... SKIPPED
      [INFO] Connector :: Support :: Maven Plugin ............... SKIPPED
      [INFO] Connector :: Twitter ............................... SKIPPED
      [INFO] Connector :: FTP ................................... SKIPPED
      [INFO] Connector :: SFTP .................................. SKIPPED
      [INFO] Connector :: Dropbox ............................... SKIPPED
      [INFO] Connector :: Support :: Test ....................... SKIPPED
      [INFO] Connector :: AWS S3 ................................ SKIPPED
      [INFO] Connector :: AWS SNS ............................... SKIPPED
      [INFO] Connector :: AWS SQS ............................... SKIPPED
      [INFO] Connector :: ActiveMQ .............................. SKIPPED
      [INFO] Connector :: AMQP .................................. SKIPPED
      [INFO] Connector :: SQL ................................... SKIPPED
      [INFO] Connector :: MQTT .................................. SKIPPED
      [INFO] Connector :: Support :: Processor .................. SKIPPED
      [INFO] Connector :: HTTP .................................. SKIPPED
      [INFO] Connector :: Salesforce ............................ SKIPPED
      [INFO] Connector :: Slack ................................. SKIPPED
      [INFO] Connector :: Gmail ................................. SKIPPED
      [INFO] Connector :: Timer ................................. SKIPPED
      [INFO] Connector :: ServiceNow ............................ SKIPPED
      [INFO] Connector :: Concur ................................ SKIPPED
      [INFO] Connector :: Kafka ................................. SKIPPED
      [INFO] Connector :: FHIR .................................. SKIPPED
      [INFO] Connector :: Webhook ............................... SKIPPED
      [INFO] Connector :: Log ................................... SKIPPED
      [INFO] Connector :: Telegram .............................. SKIPPED
      [INFO] Connector :: IRC ................................... SKIPPED
      [INFO] Connector :: API Provider .......................... SKIPPED
      [INFO] Connector :: Google Calendar ....................... SKIPPED
      [INFO] Connector :: Google Sheets ......................... SKIPPED
      [INFO] Connector :: Apache Kudu ........................... SKIPPED
      [INFO] Connector :: OData ................................. SKIPPED
      [INFO] Connector :: Box ................................... SKIPPED
      [INFO] Connector :: Flow .................................. SKIPPED
      [INFO] Connector :: REST Swagger .......................... SKIPPED
      [INFO] Connector :: EMail ................................. SKIPPED
      [INFO] Connector :: Knative ............................... SKIPPED
      [INFO] Connector :: Jira .................................. SKIPPED
      [INFO] Connector :: Support :: Catalog .................... SKIPPED
      [INFO] Server ............................................. SKIPPED
      [INFO] Server :: DAO ...................................... SKIPPED
      [INFO] Server :: JsonDB ................................... SKIPPED
      [INFO] Server :: API Generator ............................ SKIPPED
      [INFO] Server :: OpenShift Services ....................... SKIPPED
      [INFO] Server :: Verifier ................................. SKIPPED
      [INFO] Server :: Inspector ................................ SKIPPED
      [INFO] Server :: Credential ............................... SKIPPED
      [INFO] Server :: Endpoint ................................. SKIPPED
      [INFO] Server :: Update Controller ........................ SKIPPED
      [INFO] Server :: Controller ............................... SKIPPED
      [INFO] Server :: Metrics :: JsonDB ........................ SKIPPED
      [INFO] Server :: FileStore ................................ SKIPPED
      [INFO] Server :: Logging :: JsonDB ........................ SKIPPED
      [INFO] Server :: Logging :: Jaeger ........................ SKIPPED
      [INFO] Server :: Monitoring ............................... SKIPPED
      [INFO] Server :: Metrics :: Prometheus .................... SKIPPED
      [INFO] Server :: Builder :: Maven Plugin .................. SKIPPED
      [INFO] Server :: Runtime .................................. SKIPPED
      [INFO] Server :: CLI ...................................... SKIPPED
      [INFO] Server :: Builder :: Image Generator ............... SKIPPED
      [INFO] S2I ................................................ SKIPPED
      [INFO] Meta ............................................... SKIPPED
      [INFO] UI Angular ......................................... SKIPPED
      [INFO] UI React ........................................... SKIPPED
      [INFO] Documentation ...................................... SKIPPED
      [INFO] Documentation :: Maven plugin ...................... SKIPPED
      [INFO] Syndesis :: Docs ................................... SKIPPED
      [INFO] ------------------------------------------------------------------------
      [INFO] BUILD FAILURE
      [INFO] ------------------------------------------------------------------------
      [INFO] Total time: 10:29 min
      [INFO] Finished at: 2019-06-22T00:17:34Z
      [INFO] Final Memory: 383M/1278M
      [INFO] ------------------------------------------------------------------------
      [ERROR] Failed to execute goal on project integration-runtime-camelk: Could not resolve dependencies for project io.syndesis.integration:integration-runtime-camelk:jar:1.7.3.fuse-740001: Could not find artifact org.apache.camel.k:camel-k-adapter-camel-2:jar:0.3.4.fuse-740006 in fuse-repository (http://10.0.144.111:8081/repository/maven-public/) -> [Help 1]
      org.apache.maven.lifecycle.LifecycleExecutionException: Failed to execute goal on project integration-runtime-camelk: Could not resolve dependencies for project io.syndesis.integration:integration-runtime-camelk:jar:1.7.3.fuse-740001: Could not find artifact org.apache.camel.k:camel-k-adapter-camel-2:jar:0.3.4.fuse-740006 in fuse-repository (http://10.0.144.111:8081/repository/maven-public/)
          at org.apache.maven.lifecycle.internal.LifecycleDependencyResolver.getDependencies (LifecycleDependencyResolver.java:249)
          at org.apache.maven.lifecycle.internal.LifecycleDependencyResolver.resolveProjectDependencies (LifecycleDependencyResolver.java:145)
          at org.apache.maven.lifecycle.internal.MojoExecutor.ensureDependenciesAreResolved (MojoExecutor.java:246)
          at org.apache.maven.lifecycle.internal.MojoExecutor.execute (MojoExecutor.java:200)
          at org.apache.maven.lifecycle.internal.MojoExecutor.execute (MojoExecutor.java:154)
          at org.apache.maven.lifecycle.internal.MojoExecutor.execute (MojoExecutor.java:146)
          at org.apache.maven.lifecycle.internal.LifecycleModuleBuilder.buildProject (LifecycleModuleBuilder.java:117)
          at org.apache.maven.lifecycle.internal.LifecycleModuleBuilder.buildProject (LifecycleModuleBuilder.java:81)
          at org.apache.maven.lifecycle.internal.builder.singlethreaded.SingleThreadedBuilder.build (SingleThreadedBuilder.java:51)
          at org.apache.maven.lifecycle.internal.LifecycleStarter.execute (LifecycleStarter.java:128)
          at org.apache.maven.DefaultMaven.doExecute (DefaultMaven.java:309)
          at org.apache.maven.DefaultMaven.doExecute (DefaultMaven.java:194)
          at org.apache.maven.DefaultMaven.execute (DefaultMaven.java:107)
          at org.apache.maven.cli.MavenCli.execute (MavenCli.java:955)
          at org.apache.maven.cli.MavenCli.doMain (MavenCli.java:290)
          at org.apache.maven.cli.MavenCli.main (MavenCli.java:194)
          at sun.reflect.NativeMethodAccessorImpl.invoke0 (Native Method)
          at sun.reflect.NativeMethodAccessorImpl.invoke (NativeMethodAccessorImpl.java:62)
          at sun.reflect.DelegatingMethodAccessorImpl.invoke (DelegatingMethodAccessorImpl.java:43)
          at java.lang.reflect.Method.invoke (Method.java:498)
          at org.codehaus.plexus.classworlds.launcher.Launcher.launchEnhanced (Launcher.java:289)
          at org.codehaus.plexus.classworlds.launcher.Launcher.launch (Launcher.java:229)
          at org.codehaus.plexus.classworlds.launcher.Launcher.mainWithExitCode (Launcher.java:415)
          at org.codehaus.plexus.classworlds.launcher.Launcher.main (Launcher.java:356)
      Caused by: org.apache.maven.project.DependencyResolutionException: Could not resolve dependencies for project io.syndesis.integration:integration-runtime-camelk:jar:1.7.3.fuse-740001: Could not find artifact org.apache.camel.k:camel-k-adapter-camel-2:jar:0.3.4.fuse-740006 in fuse-repository (http://10.0.144.111:8081/repository/maven-public/)
          at org.apache.maven.project.DefaultProjectDependenciesResolver.resolve (DefaultProjectDependenciesResolver.java:209)
          at org.apache.maven.lifecycle.internal.LifecycleDependencyResolver.getDependencies (LifecycleDependencyResolver.java:223)
          at org.apache.maven.lifecycle.internal.LifecycleDependencyResolver.resolveProjectDependencies (LifecycleDependencyResolver.java:145)
          at org.apache.maven.lifecycle.internal.MojoExecutor.ensureDependenciesAreResolved (MojoExecutor.java:246)
          at org.apache.maven.lifecycle.internal.MojoExecutor.execute (MojoExecutor.java:200)
          at org.apache.maven.lifecycle.internal.MojoExecutor.execute (MojoExecutor.java:154)
          at org.apache.maven.lifecycle.internal.MojoExecutor.execute (MojoExecutor.java:146)
          at org.apache.maven.lifecycle.internal.LifecycleModuleBuilder.buildProject (LifecycleModuleBuilder.java:117)
          at org.apache.maven.lifecycle.internal.LifecycleModuleBuilder.buildProject (LifecycleModuleBuilder.java:81)
          at org.apache.maven.lifecycle.internal.builder.singlethreaded.SingleThreadedBuilder.build (SingleThreadedBuilder.java:51)
          at org.apache.maven.lifecycle.internal.LifecycleStarter.execute (LifecycleStarter.java:128)
          at org.apache.maven.DefaultMaven.doExecute (DefaultMaven.java:309)
          at org.apache.maven.DefaultMaven.doExecute (DefaultMaven.java:194)
          at org.apache.maven.DefaultMaven.execute (DefaultMaven.java:107)
          at org.apache.maven.cli.MavenCli.execute (MavenCli.java:955)
          at org.apache.maven.cli.MavenCli.doMain (MavenCli.java:290)
          at org.apache.maven.cli.MavenCli.main (MavenCli.java:194)
          at sun.reflect.NativeMethodAccessorImpl.invoke0 (Native Method)
          at sun.reflect.NativeMethodAccessorImpl.invoke (NativeMethodAccessorImpl.java:62)
          at sun.reflect.DelegatingMethodAccessorImpl.invoke (DelegatingMethodAccessorImpl.java:43)
          at java.lang.reflect.Method.invoke (Method.java:498)
          at org.codehaus.plexus.classworlds.launcher.Launcher.launchEnhanced (Launcher.java:289)
          at org.codehaus.plexus.classworlds.launcher.Launcher.launch (Launcher.java:229)
          at org.codehaus.plexus.classworlds.launcher.Launcher.mainWithExitCode (Launcher.java:415)
          at org.codehaus.plexus.classworlds.launcher.Launcher.main (Launcher.java:356)
      Caused by: org.eclipse.aether.resolution.DependencyResolutionException: Could not find artifact org.apache.camel.k:camel-k-adapter-camel-2:jar:0.3.4.fuse-740006 in fuse-repository (http://10.0.144.111:8081/repository/maven-public/)
          at org.eclipse.aether.internal.impl.DefaultRepositorySystem.resolveDependencies (DefaultRepositorySystem.java:355)
          at org.apache.maven.project.DefaultProjectDependenciesResolver.resolve (DefaultProjectDependenciesResolver.java:202)
          at org.apache.maven.lifecycle.internal.LifecycleDependencyResolver.getDependencies (LifecycleDependencyResolver.java:223)
          at org.apache.maven.lifecycle.internal.LifecycleDependencyResolver.resolveProjectDependencies (LifecycleDependencyResolver.java:145)
          at org.apache.maven.lifecycle.internal.MojoExecutor.ensureDependenciesAreResolved (MojoExecutor.java:246)
          at org.apache.maven.lifecycle.internal.MojoExecutor.execute (MojoExecutor.java:200)
          at org.apache.maven.lifecycle.internal.MojoExecutor.execute (MojoExecutor.java:154)
          at org.apache.maven.lifecycle.internal.MojoExecutor.execute (MojoExecutor.java:146)
          at org.apache.maven.lifecycle.internal.LifecycleModuleBuilder.buildProject (LifecycleModuleBuilder.java:117)
          at org.apache.maven.lifecycle.internal.LifecycleModuleBuilder.buildProject (LifecycleModuleBuilder.java:81)
          at org.apache.maven.lifecycle.internal.builder.singlethreaded.SingleThreadedBuilder.build (SingleThreadedBuilder.java:51)
          at org.apache.maven.lifecycle.internal.LifecycleStarter.execute (LifecycleStarter.java:128)
          at org.apache.maven.DefaultMaven.doExecute (DefaultMaven.java:309)
          at org.apache.maven.DefaultMaven.doExecute (DefaultMaven.java:194)
          at org.apache.maven.DefaultMaven.execute (DefaultMaven.java:107)
          at org.apache.maven.cli.MavenCli.execute (MavenCli.java:955)
          at org.apache.maven.cli.MavenCli.doMain (MavenCli.java:290)
          at org.apache.maven.cli.MavenCli.main (MavenCli.java:194)
          at sun.reflect.NativeMethodAccessorImpl.invoke0 (Native Method)
          at sun.reflect.NativeMethodAccessorImpl.invoke (NativeMethodAccessorImpl.java:62)
          at sun.reflect.DelegatingMethodAccessorImpl.invoke (DelegatingMethodAccessorImpl.java:43)
          at java.lang.reflect.Method.invoke (Method.java:498)
          at org.codehaus.plexus.classworlds.launcher.Launcher.launchEnhanced (Launcher.java:289)
          at org.codehaus.plexus.classworlds.launcher.Launcher.launch (Launcher.java:229)
          at org.codehaus.plexus.classworlds.launcher.Launcher.mainWithExitCode (Launcher.java:415)
          at org.codehaus.plexus.classworlds.launcher.Launcher.main (Launcher.java:356)
      Caused by: org.eclipse.aether.resolution.ArtifactResolutionException: Could not find artifact org.apache.camel.k:camel-k-adapter-camel-2:jar:0.3.4.fuse-740006 in fuse-repository (http://10.0.144.111:8081/repository/maven-public/)
          at org.eclipse.aether.internal.impl.DefaultArtifactResolver.resolve (DefaultArtifactResolver.java:422)
          at org.eclipse.aether.internal.impl.DefaultArtifactResolver.resolveArtifacts (DefaultArtifactResolver.java:224)
          at org.eclipse.aether.internal.impl.DefaultRepositorySystem.resolveDependencies (DefaultRepositorySystem.java:338)
          at org.apache.maven.project.DefaultProjectDependenciesResolver.resolve (DefaultProjectDependenciesResolver.java:202)
          at org.apache.maven.lifecycle.internal.LifecycleDependencyResolver.getDependencies (LifecycleDependencyResolver.java:223)
          at org.apache.maven.lifecycle.internal.LifecycleDependencyResolver.resolveProjectDependencies (LifecycleDependencyResolver.java:145)
          at org.apache.maven.lifecycle.internal.MojoExecutor.ensureDependenciesAreResolved (MojoExecutor.java:246)
          at org.apache.maven.lifecycle.internal.MojoExecutor.execute (MojoExecutor.java:200)
          at org.apache.maven.lifecycle.internal.MojoExecutor.execute (MojoExecutor.java:154)
          at org.apache.maven.lifecycle.internal.MojoExecutor.execute (MojoExecutor.java:146)
          at org.apache.maven.lifecycle.internal.LifecycleModuleBuilder.buildProject (LifecycleModuleBuilder.java:117)
          at org.apache.maven.lifecycle.internal.LifecycleModuleBuilder.buildProject (LifecycleModuleBuilder.java:81)
          at org.apache.maven.lifecycle.internal.builder.singlethreaded.SingleThreadedBuilder.build (SingleThreadedBuilder.java:51)
          at org.apache.maven.lifecycle.internal.LifecycleStarter.execute (LifecycleStarter.java:128)
          at org.apache.maven.DefaultMaven.doExecute (DefaultMaven.java:309)
          at org.apache.maven.DefaultMaven.doExecute (DefaultMaven.java:194)
          at org.apache.maven.DefaultMaven.execute (DefaultMaven.java:107)
          at org.apache.maven.cli.MavenCli.execute (MavenCli.java:955)
          at org.apache.maven.cli.MavenCli.doMain (MavenCli.java:290)
          at org.apache.maven.cli.MavenCli.main (MavenCli.java:194)
          at sun.reflect.NativeMethodAccessorImpl.invoke0 (Native Method)
          at sun.reflect.NativeMethodAccessorImpl.invoke (NativeMethodAccessorImpl.java:62)
          at sun.reflect.DelegatingMethodAccessorImpl.invoke (DelegatingMethodAccessorImpl.java:43)
          at java.lang.reflect.Method.invoke (Method.java:498)
          at org.codehaus.plexus.classworlds.launcher.Launcher.launchEnhanced (Launcher.java:289)
          at org.codehaus.plexus.classworlds.launcher.Launcher.launch (Launcher.java:229)
          at org.codehaus.plexus.classworlds.launcher.Launcher.mainWithExitCode (Launcher.java:415)
          at org.codehaus.plexus.classworlds.launcher.Launcher.main (Launcher.java:356)
      Caused by: org.eclipse.aether.transfer.ArtifactNotFoundException: Could not find artifact org.apache.camel.k:camel-k-adapter-camel-2:jar:0.3.4.fuse-740006 in fuse-repository (http://10.0.144.111:8081/repository/maven-public/)
          at org.eclipse.aether.connector.basic.ArtifactTransportListener.transferFailed (ArtifactTransportListener.java:48)
          at org.eclipse.aether.connector.basic.BasicRepositoryConnector$TaskRunner.run (BasicRepositoryConnector.java:365)
          at org.eclipse.aether.util.concurrency.RunnableErrorForwarder$1.run (RunnableErrorForwarder.java:75)
          at java.util.concurrent.ThreadPoolExecutor.runWorker (ThreadPoolExecutor.java:1149)
          at java.util.concurrent.ThreadPoolExecutor$Worker.run (ThreadPoolExecutor.java:624)
          at java.lang.Thread.run (Thread.java:748)
      [ERROR] 
      [ERROR] Re-run Maven using the -X switch to enable full debug logging.
      [ERROR] 
      [ERROR] For more information about the errors and possible solutions, please read the following articles:
      [ERROR] [Help 1] http://cwiki.apache.org/confluence/display/MAVEN/DependencyResolutionException
      [ERROR] 
      [ERROR] After correcting the problems, you can resume the build with the command
      [ERROR]   mvn <goals> -rf :integration-runtime-camelk
      [Pipeline] }
      [Pipeline] // configFileProvider
      [Pipeline] sh
      + '[' -f /home/jenkins/syndesis@tmp/settings.xml ']'
      + rm -f /home/jenkins/syndesis@tmp/settings.xml
      [Pipeline] }
      [Pipeline] // ws
      [Pipeline] echo
      

        Gliffy Diagrams

          Attachments

            Activity

              People

              • Assignee:
                valdar Andrea Tarocchi
                Reporter:
                tcunning Thomas Cunningham
              • Votes:
                0 Vote for this issue
                Watchers:
                3 Start watching this issue

                Dates

                • Created:
                  Updated:
                  Resolved: