Uploaded image for project: 'Red Hat Fuse'
  1. Red Hat Fuse
  2. ENTESB-10524

NoSuchMethodError: CamelCxfClientImpl.reloadResponseContext(Map)

    Details

    • Type: Bug
    • Status: Closed
    • Priority: Major
    • Resolution: Done
    • Affects Version/s: fuse-7.4-GA
    • Fix Version/s: fuse-7.4-GA
    • Component/s: Fuse EAP
    • Labels:
      None
    • Sprint:
      Fuse 7.4 Sprint 46 - Dev #2

      Description

      This shows on the 5.3.x.redhat-7-x branch after upgrade to EAP 7.2.1.GA-redhat-00003, which uses CXF 3.2.7.redhat-00001.

      [ERROR] Tests run: 1, Failures: 0, Errors: 1, Skipped: 0, Time elapsed: 17.729 s <<< FAILURE! - in org.wildfly.camel.test.cxf.ws.CXFWSSSLProducerIntegrationTest
      [ERROR] testCxfWSSSLProducer(org.wildfly.camel.test.cxf.ws.CXFWSSSLProducerIntegrationTest)  Time elapsed: 0.817 s  <<< ERROR!
      org.apache.camel.CamelExecutionException: Exception occurred during execution on the exchange: Exchange[ID-MacBook-1555410036205-0-1]
      	at org.wildfly.camel.test.cxf.ws.CXFWSSSLProducerIntegrationTest.testCxfWSSSLProducer(CXFWSSSLProducerIntegrationTest.java:70)
      Caused by: java.lang.NoSuchMethodError: org.apache.camel.component.cxf.CxfEndpoint$CamelCxfClientImpl.reloadResponseContext(Ljava/util/Map;)Ljava/util/Map;
      	at org.wildfly.camel.test.cxf.ws.CXFWSSSLProducerIntegrationTest.testCxfWSSSLProducer(CXFWSSSLProducerIntegrationTest.java:70)
      

        Gliffy Diagrams

          Attachments

            Issue Links

              Activity

                People

                • Assignee:
                  ffang Freeman(Yue) Fang
                  Reporter:
                  thomas.diesler Thomas Diesler
                  Tester:
                  Viliam Kasala
                • Votes:
                  0 Vote for this issue
                  Watchers:
                  3 Start watching this issue

                  Dates

                  • Created:
                    Updated:
                    Resolved: