Details

    • Sprint:
      Fuse 7.3 Sprint 42 - Bug fix

      Description

      wildfly-camel is failing in the pipeline (https://fusesource-jenkins.rhev-ci-vms.eng.rdu2.redhat.com/job/fuse-7.3-release-pipeline/141/console). We need this one passing to build CR1 candidate for 7.3. Build log snippet:

      [INFO] Wildfly Camel :: Feature :: ExtrasC ................ SUCCESS [  0.753 s]
      [INFO] Wildfly Camel :: Feature :: Pack ................... FAILURE [ 11.066 s]
      [INFO] Wildfly Camel :: Catalog ........................... SKIPPED
      [INFO] Wildfly Camel :: Enricher .......................... SKIPPED
      [INFO] Wildfly Camel :: Testsuite ......................... SKIPPED
      [INFO] Wildfly Camel :: Testsuite :: Common ............... SKIPPED
      [INFO] Wildfly Camel :: Testsuite :: Camel ................ SKIPPED
      [INFO] Wildfly Camel :: Testsuite :: Standalone ........... SKIPPED
      [INFO] Wildfly Camel :: Testsuite :: Standalone :: Smoke .. SKIPPED
      [INFO] Wildfly Camel :: Testsuite :: Standalone :: Basic .. SKIPPED
      [INFO] Wildfly Camel :: Testsuite :: Standalone :: Extra .. SKIPPED
      [INFO] Wildfly Camel :: Testsuite :: Standalone :: Docker . SKIPPED
      [INFO] Wildfly Camel :: Archetypes ........................ SKIPPED
      [INFO] Wildfly Camel :: Archetypes :: CDI ................. SKIPPED
      [INFO] Wildfly Camel :: Archetypes :: Spring .............. SKIPPED
      [INFO] Wildfly Camel :: Patch ............................. SKIPPED
      [INFO] ------------------------------------------------------------------------
      [INFO] BUILD FAILURE
      [INFO] ------------------------------------------------------------------------
      [INFO] Total time: 01:04 min
      [INFO] Finished at: 2019-03-08T19:39:16+00:00
      [INFO] Final Memory: 369M/1389M
      [INFO] ------------------------------------------------------------------------
      [ERROR] Failed to execute goal org.codehaus.gmaven:groovy-maven-plugin:2.0:execute (module-check) on project wildfly-camel-feature-pack: Execution module-check of goal org.codehaus.gmaven:groovy-maven-plugin:2.0:execute failed: org.apache.maven.plugin.MojoExecutionException: Module dependency conflicts were detected. Please fix your module dependencies. -> [Help 1]
      org.apache.maven.lifecycle.LifecycleExecutionException: Failed to execute goal org.codehaus.gmaven:groovy-maven-plugin:2.0:execute (module-check) on project wildfly-camel-feature-pack: Execution module-check of goal org.codehaus.gmaven:groovy-maven-plugin:2.0:execute failed: org.apache.maven.plugin.MojoExecutionException: Module dependency conflicts were detected. Please fix your module dependencies.
      	at org.apache.maven.lifecycle.internal.MojoExecutor.execute(MojoExecutor.java:212)
      	at org.apache.maven.lifecycle.internal.MojoExecutor.execute(MojoExecutor.java:153)
      	at org.apache.maven.lifecycle.internal.MojoExecutor.execute(MojoExecutor.java:145)
      	at org.apache.maven.lifecycle.internal.LifecycleModuleBuilder.buildProject(LifecycleModuleBuilder.java:116)
      	at org.apache.maven.lifecycle.internal.LifecycleModuleBuilder.buildProject(LifecycleModuleBuilder.java:80)
      	at org.apache.maven.lifecycle.internal.builder.singlethreaded.SingleThreadedBuilder.build(SingleThreadedBuilder.java:51)
      	at org.apache.maven.lifecycle.internal.LifecycleStarter.execute(LifecycleStarter.java:128)
      	at org.apache.maven.DefaultMaven.doExecute(DefaultMaven.java:307)
      	at org.apache.maven.DefaultMaven.doExecute(DefaultMaven.java:193)
      	at org.apache.maven.DefaultMaven.execute(DefaultMaven.java:106)
      	at org.apache.maven.cli.MavenCli.execute(MavenCli.java:863)
      	at org.apache.maven.cli.MavenCli.doMain(MavenCli.java:288)
      	at org.apache.maven.cli.MavenCli.main(MavenCli.java:199)
      	at sun.reflect.NativeMethodAccessorImpl.invoke0(Native Method)
      	at sun.reflect.NativeMethodAccessorImpl.invoke(NativeMethodAccessorImpl.java:62)
      	at sun.reflect.DelegatingMethodAccessorImpl.invoke(DelegatingMethodAccessorImpl.java:43)
      	at java.lang.reflect.Method.invoke(Method.java:498)
      	at org.codehaus.plexus.classworlds.launcher.Launcher.launchEnhanced(Launcher.java:289)
      	at org.codehaus.plexus.classworlds.launcher.Launcher.launch(Launcher.java:229)
      	at org.codehaus.plexus.classworlds.launcher.Launcher.mainWithExitCode(Launcher.java:415)
      	at org.codehaus.plexus.classworlds.launcher.Launcher.main(Launcher.java:356)
      Caused by: org.apache.maven.plugin.PluginExecutionException: Execution module-check of goal org.codehaus.gmaven:groovy-maven-plugin:2.0:execute failed: org.apache.maven.plugin.MojoExecutionException: Module dependency conflicts were detected. Please fix your module dependencies.
      	at org.apache.maven.plugin.DefaultBuildPluginManager.executeMojo(DefaultBuildPluginManager.java:145)
      	at org.apache.maven.lifecycle.internal.MojoExecutor.execute(MojoExecutor.java:207)
      	... 20 more
      Caused by: java.lang.RuntimeException: org.apache.maven.plugin.MojoExecutionException: Module dependency conflicts were detected. Please fix your module dependencies.
      	at com.google.common.base.Throwables.propagate(Throwables.java:160)
      	at org.codehaus.gmaven.adapter.impl.GroovyRuntimeImpl$3.call(GroovyRuntimeImpl.java:145)
      	at groovy.lang.Closure.call(Closure.java:427)
      	at sun.reflect.NativeMethodAccessorImpl.invoke0(Native Method)
      	at sun.reflect.NativeMethodAccessorImpl.invoke(NativeMethodAccessorImpl.java:62)
      	at sun.reflect.DelegatingMethodAccessorImpl.invoke(DelegatingMethodAccessorImpl.java:43)
      	at java.lang.reflect.Method.invoke(Method.java:498)
      	at org.codehaus.groovy.reflection.CachedMethod.invoke(CachedMethod.java:90)
      	at groovy.lang.MetaMethod.doMethodInvoke(MetaMethod.java:233)
      	at groovy.lang.MetaClassImpl.invokeMethod(MetaClassImpl.java:1085)
      	at groovy.lang.MetaClassImpl.invokeMethod(MetaClassImpl.java:909)
      	at groovy.lang.MetaClassImpl.invokePropertyOrMissing(MetaClassImpl.java:1131)
      	at groovy.lang.MetaClassImpl.invokeMethod(MetaClassImpl.java:1087)
      	at groovy.lang.MetaClassImpl.invokeMethod(MetaClassImpl.java:909)
      	at org.codehaus.groovy.runtime.callsite.PogoMetaClassSite.callCurrent(PogoMetaClassSite.java:66)
      	at org.codehaus.groovy.runtime.callsite.CallSiteArray.defaultCallCurrent(CallSiteArray.java:49)
      	at org.codehaus.groovy.runtime.callsite.AbstractCallSite.callCurrent(AbstractCallSite.java:133)
      	at org.codehaus.groovy.runtime.callsite.AbstractCallSite.callCurrent(AbstractCallSite.java:141)
      	at module-checker.run(module-checker.groovy:367)
      	at groovy.lang.GroovyShell.evaluate(GroovyShell.java:518)
      	at org.codehaus.gmaven.adapter.impl.ScriptExecutorImpl.execute(ScriptExecutorImpl.java:80)
      	at org.codehaus.gmaven.plugin.ExecuteMojo$1.run(ExecuteMojo.java:100)
      	at org.codehaus.gmaven.plugin.util.SystemNoExitGuard.run(SystemNoExitGuard.java:45)
      	at org.codehaus.gmaven.plugin.ExecuteMojo.run(ExecuteMojo.java:96)
      	at org.codehaus.gmaven.plugin.MojoSupport.execute(MojoSupport.java:45)
      	at org.apache.maven.plugin.DefaultBuildPluginManager.executeMojo(DefaultBuildPluginManager.java:134)
      	... 21 more
      Caused by: org.apache.maven.plugin.MojoExecutionException: Module dependency conflicts were detected. Please fix your module dependencies.
      	at org.codehaus.gmaven.plugin.FailClosureTarget.call(FailClosureTarget.java:83)
      	at org.codehaus.gmaven.adapter.impl.GroovyRuntimeImpl$3.call(GroovyRuntimeImpl.java:142)
      	... 45 more
      [ERROR] 
      

        Gliffy Diagrams

          Attachments

            Issue Links

              Activity

                People

                • Assignee:
                  thomas.diesler Thomas Diesler
                  Reporter:
                  janstey Jonathan Anstey
                • Votes:
                  0 Vote for this issue
                  Watchers:
                  2 Start watching this issue

                  Dates

                  • Created:
                    Updated:
                    Resolved: